{"text_format":"1","workbook":"xlsx","n_sheets":14,"sheets":["2023 NIST (for reference)","User Inputs_FPI_Calculator","Help enabling macros","More information","Calculator","Diagram","WPN 22-10","Results_convert_json","References","Results (2)","Results","Sheet1","States","Sheet3"],"not_rendered":{"charts":0,"images":8,"macros":1,"external_links":0,"defined_names":6,"comments":0,"pivot_tables":0},"unopened":[],"bounds":{"document_bytes":16777216,"sheet_cells":100000,"rows_first":2000,"rows_last":500,"rows_between":2000,"halvings":0,"cell_chars":16384,"cell_head_chars":4096},"cells_cut":0,"cells_raw":0,"read":"whole","date_system":"1900"}

{"sheet":"2023 NIST (for reference)","index":0,"n_rows":250,"n_cols":19,"rows_kept":250,"cut":false,"hidden":true,"merged":[]}
[null,null,null,null,"$/MMBtu","$/MMBtu","$/MMBtu","$/MMBtu","$/MMBtu","FPI","FPI","FPI","FPI","FPI","UPV","UPV","UPV","UPV","UPV"]
["Lookup Reference",null,"Year","Fuel Type","Region 1 - Northeast","Region 2 - Midwest","Region 3 - South","Region 4 - West","Region 5 - US",{"$f":"E2","v":"Region 1 - Northeast"},{"$f":"F2","v":"Region 2 - Midwest"},"Region 3 - South","Region 4 - West","Region 5 - US",{"$f":"J2","v":"Region 1 - Northeast"},{"$f":"K2","v":"Region 2 - Midwest"},"Region 3 - South","Region 4 - West","Region 5 - US"]
[{"$f":"C3&D3","v":"0Natural Gas"},2023,0,"Natural Gas",null,null,null,null,null,1,1,1,1,1]
["1Natural Gas",{"$f":"B3+1","v":2024},1,"Natural Gas",null,null,null,null,null,0.91329204069882641,0.89219487537819597,0.95417376898279616,0.98031290628534118,0.92914110822615636]
["2Natural Gas",{"$f":"B4+1","v":2025},2,"Natural Gas",null,null,null,null,null,0.85663072325214251,0.81883333710470174,0.92388425678430797,0.91127274490115895,0.86915379139806792]
["3Natural Gas",2026,3,"Natural Gas",null,null,null,null,null,0.821405504535209,0.77327755929571562,0.90091552712611356,0.83484140401895668,0.82420581968139972]
["4Natural Gas",2027,4,"Natural Gas",null,null,null,null,null,0.7950080126603315,0.74456520666661763,0.8895900097535735,0.77109079382382839,0.79201861040056953]
["5Natural Gas",2028,5,"Natural Gas",null,null,null,null,null,0.77704238170465145,0.73070613750697644,0.88839772420721863,0.71793289757727208,0.77097904221441349]
["6Natural Gas",2029,6,"Natural Gas",null,null,null,null,null,0.77624952895441013,0.7314186841808783,0.89331528829303553,0.70464145203382345,0.76907889737992474]
["7Natural Gas",2030,7,"Natural Gas",null,null,null,null,null,0.77226803066909022,0.73777696100150925,0.90134750573747768,0.70591713964079483,0.77225080082641495]
["8Natural Gas",2031,8,"Natural Gas",null,null,null,null,null,0.77073927867091163,0.74721741745799075,0.91190056128085861,0.71119303080644869,0.77843743195837878]
["9Natural Gas",2032,9,"Natural Gas",null,null,null,null,null,0.77130092666176364,0.75564899992148982,0.92312574050988361,0.71696837151239889,0.7850950130865012]
["10Natural Gas",2033,10,"Natural Gas",null,null,null,null,null,0.77513974700427479,0.76670608788022543,0.93630567333427117,0.72576281843064205,0.79449343239490477]
["11Natural Gas",2034,11,"Natural Gas",null,null,null,null,null,0.77717929066230296,0.77805477298290004,0.94826074492492329,0.73548382624922659,0.80349351157338311]
["12Natural Gas",2035,12,"Natural Gas",null,null,null,null,null,0.77824423347350025,0.78809178886996822,0.95876421942225243,0.74432053488527972,0.81133259463121665]
["13Natural Gas",2036,13,"Natural Gas",null,null,null,null,null,0.77935083390107118,0.79363578999919193,0.96583375497696067,0.74851464443343485,0.81596527489586268]
["14Natural Gas",2037,14,"Natural Gas",null,null,null,null,null,0.7830207394189046,0.79975869433781355,0.97269004002978998,0.75258583376316301,0.82131407936687584]
["15Natural Gas",2038,15,"Natural Gas",null,null,null,null,null,0.79141485418405388,0.80886162181089349,0.98220408513605773,0.76050682310848683,0.83021234941983402]
["16Natural Gas",2039,16,"Natural Gas",null,null,null,null,null,0.79483037616926844,0.81149584481288506,0.98641458817109029,0.76114530931431823,0.83305028034021289]
["17Natural Gas",2040,17,"Natural Gas",null,null,null,null,null,0.79764070048733493,0.81692860478372742,0.99402769325754481,0.76500983620007323,0.83807807257640576]
["18Natural Gas",2041,18,"Natural Gas",null,null,null,null,null,0.80279999089420151,0.82419888465839464,1.0024028107417744,0.77077090741299525,0.84484485148256849]
["19Natural Gas",2042,19,"Natural Gas",null,null,null,null,null,0.80471177922085579,0.82653170010840771,1.0071956209872381,0.77365585155398331,0.84788986036268943]
["20Natural Gas",2043,20,"Natural Gas",null,null,null,null,null,0.80379165833679533,0.82486964243449168,1.0090287758239624,0.77337994819727018,0.84764628664426633]
["21Natural Gas",2044,21,"Natural Gas",null,null,null,null,null,0.79872053855026937,0.82167248693641681,1.0103462419208484,0.7704535908826603,0.84515923275203098]
["22Natural Gas",2045,22,"Natural Gas",null,null,null,null,null,0.80290481945750158,0.8206522971397251,1.0133140514061929,0.77406313870857735,0.84756863868073795]
["23Natural Gas",2046,23,"Natural Gas",null,null,null,null,null,0.80264632251784873,0.81965744340514801,1.0163174442095102,0.84131919429998014,0.86506769621274249]
["24Natural Gas",2047,24,"Natural Gas",null,null,null,null,null,0.79735546604217444,0.81770632796275711,1.0182106172275331,0.8660605619031958,0.86979139426177898]
["25Natural Gas",2048,25,"Natural Gas",null,null,null,null,null,0.79117527082088335,0.81497484257606356,1.0198875191861425,0.86511488989641494,0.86777735984074555]
["26Natural Gas",2049,26,"Natural Gas",null,null,null,null,null,0.79004334413914146,0.81310137534397708,1.0214986884718553,0.86482196439390613,0.86744474942042393]
["27Natural Gas",2050,27,"Natural Gas",null,null,null,null,null,0.79481856228172743,0.81245938997108613,1.0240487072998787,0.86542230403108378,0.86935875838181453]
["28Natural Gas",2051,28,"Natural Gas",null,null,null,null,null,0.79511887528464631,0.81114610968205569,1.0263641834212065,0.88061034203686706,0.87325414161856352]
["29Natural Gas",2052,29,"Natural Gas",null,null,null,null,null,0.79345375909690141,0.80951363792996067,1.0284961280092617,0.90102954486751574,0.87765191808877308]
["30Natural Gas",2053,30,"Natural Gas",null,null,null,null,null,0.79179212994990578,0.8078844516081839,1.030632501032954,0.92192221913534389,0.8820718421068271]
["0Oil",{"$f":"B3","v":2023},0,"Oil",null,null,null,null,null,1,1,1,1,1]
["1Oil",{"$f":"B4","v":2024},1,"Oil",null,null,null,null,null,0.95641932603800695,0.9353292595307855,0.95806442189507024,0.9596828259813811,0.95506661711657392]
["2Oil",2025,2,"Oil",null,null,null,null,null,0.91156265728575148,0.86846671501349892,0.91388472581688673,0.91330895166801818,0.90901072496357682]
["3Oil",2026,3,"Oil",null,null,null,null,null,0.88989565610075783,0.83184005561361607,0.89168725478682809,0.88964723820021419,0.88652165334099065]
["4Oil",2027,4,"Oil",null,null,null,null,null,0.87706022837128084,0.80763506842701827,0.87838722985800644,0.87526585386183964,0.87299663311774434]
["5Oil",2028,5,"Oil",null,null,null,null,null,0.86833090932567103,0.78639708909870487,0.86737262313832431,0.86232679786134725,0.86330341660264731]
["6Oil",2029,6,"Oil",null,null,null,null,null,0.86860655438991574,0.78434461971313663,0.86650018544100105,0.86097861362888795,0.86316153855228761]
["7Oil",2030,7,"Oil",null,null,null,null,null,0.86967857623343481,0.78475918565735236,0.8672963702855867,0.86205559858561076,0.86400039858580258]
["8Oil",2031,8,"Oil",null,null,null,null,null,0.87387923196846662,0.78999456262496248,0.87141031592369922,0.86547726425671789,0.86801610086120506]
["9Oil",2032,9,"Oil",null,null,null,null,null,0.87734613071906187,0.79401011859788151,0.8744488633709262,0.86933002324909658,0.87129063159137754]
["10Oil",2033,10,"Oil",null,null,null,null,null,0.88095828290480493,0.79695345754897251,0.87676851083150742,0.87135834742203488,0.87454544990224614]
["11Oil",2034,11,"Oil",null,null,null,null,null,0.88291356108362296,0.80064422983108707,0.87944879111358032,0.87396763122519694,0.87644323911595723]
["12Oil",2035,12,"Oil",null,null,null,null,null,0.88758033783755308,0.80406646997962217,0.88219823576104273,0.87693841076462198,0.88067295797765599]
["13Oil",2036,13,"Oil",null,null,null,null,null,0.88932123889568238,0.80742636393635958,0.88463226048212318,0.87942932981491606,0.88234212867501494]
["14Oil",2037,14,"Oil",null,null,null,null,null,0.89238216244834845,0.81128671178876166,0.88751805591206145,0.88183042675171408,0.88519454679793641]
["15Oil",2038,15,"Oil",null,null,null,null,null,0.89551331069502804,0.81490324746504861,0.8902574455694664,0.88458739626402361,0.88809939431059459]
["16Oil",2039,16,"Oil",null,null,null,null,null,0.89727959745083274,0.81739596817851523,0.89212520937837336,0.88667469890902706,0.88970368765637908]
["17Oil",2040,17,"Oil",null,null,null,null,null,0.89876356249846956,0.81994191028148922,0.89399485617984853,0.8889455339191682,0.89107356059177689]
["18Oil",2041,18,"Oil",null,null,null,null,null,0.90273408281967038,0.82572969903027815,0.89828113308461544,0.89329553387332161,0.89493583419689493]
["19Oil",2042,19,"Oil",null,null,null,null,null,0.90387304208654806,0.82801347093452038,0.89993502152153781,0.89486521688636955,0.89595555955012063]
["20Oil",2043,20,"Oil",null,null,null,null,null,0.90650983017829623,0.83192858691918081,0.90283037849069225,0.89775335639638043,0.89844893642050816]
["21Oil",2044,21,"Oil",null,null,null,null,null,0.90543192188740906,0.83076608921698025,0.90196358245682806,0.89710097763432051,0.89718309282135889]
["22Oil",2045,22,"Oil",null,null,null,null,null,0.90568122831570397,0.8335018627565618,0.90384059132855354,0.8988804625100687,0.89746169650561047]
["23Oil",2046,23,"Oil",null,null,null,null,null,0.9106420673108151,0.84158212585202252,0.90976453405329272,0.90764854615200052,0.90250204464234685]
["24Oil",2047,24,"Oil",null,null,null,null,null,0.9130151574608496,0.84437881471471299,0.91179802636425322,0.9108789428130577,0.90467281596441484]
["25Oil",2048,25,"Oil",null,null,null,null,null,0.9141554345784213,0.84592966256281732,0.91280807961370958,0.91189630607860472,0.90558870018895321]
["26Oil",2049,26,"Oil",null,null,null,null,null,0.91606634768138229,0.84872743848602639,0.91489582289535021,0.91371879862471594,0.90730304843743104]
["27Oil",2050,27,"Oil",null,null,null,null,null,0.91678284882491301,0.84983807429369662,0.91572990484590533,0.91430025147387284,0.90779744970412424]
["28Oil",2051,28,"Oil",null,null,null,null,null,0.91848320853748633,0.85226681472767363,0.91749469747452095,0.91655010305897155,0.90931117675802131]
["29Oil",2052,29,"Oil",null,null,null,null,null,0.92067693660507088,0.85536776312658047,0.91974698894697526,0.9195289521830825,0.91133242515272339]
["30Oil",2053,30,"Oil",null,null,null,null,null,0.92287590422716215,0.85847999423743437,0.9220048094071075,0.92251748276604073,0.91335816644840095]
["0Electricity",2023,0,"Electricity",null,null,null,null,null,1,1,1,1,1]
["1Electricity",2024,1,"Electricity",null,null,null,null,null,1.0073790750790836,0.98633564647983896,0.98064180302702153,0.9348597229818798,0.97683480360914721]
[{"$f":"C67&D67","v":"2Electricity"},2025,2,"Electricity",null,null,null,null,null,1.0036659429064798,0.96839798798966437,0.96094778111744605,0.86722030620246682,0.94974369665238745]
["3Electricity",2026,3,"Electricity",null,null,null,null,null,0.99343619903446789,0.95323512673035105,0.93843565263201523,0.84483048522146464,0.92985891246025165]
["4Electricity",2027,4,"Electricity",null,null,null,null,null,0.99171036890084074,0.93528820397125045,0.91848098376660692,0.83991193264594588,0.91598776042592012]
["5Electricity",2028,5,"Electricity",null,null,null,null,null,0.99428634078539502,0.92754157179367025,0.90230435517394258,0.83783409529617092,0.90627153124844395]
["6Electricity",2029,6,"Electricity",null,null,null,null,null,0.99979223901475001,0.92383419020512569,0.89453943578918149,0.83833743588948628,0.90234173457566402]
["7Electricity",2030,7,"Electricity",null,null,null,null,null,1.0038895984409248,0.9214378505724965,0.89550088292372843,0.84362183838221783,0.90353815617109179]
["8Electricity",2031,8,"Electricity",null,null,null,null,null,1.011011064569179,0.92120929094905313,0.89944442475189501,0.85237730143056756,0.90766272165096429]
["9Electricity",2032,9,"Electricity",null,null,null,null,null,1.0244690396253977,0.92234336226803493,0.9004475834178709,0.86307059287030707,0.9120737585866433]
["10Electricity",2033,10,"Electricity",null,null,null,null,null,1.0373170658147781,0.92445936606778933,0.91584345428113656,0.8743015768109712,0.92340736486172625]
["11Electricity",2034,11,"Electricity",null,null,null,null,null,1.0544977327719038,0.92763467888811368,0.9295179817327317,0.88463585004845546,0.93473895140148444]
["12Electricity",2035,12,"Electricity",null,null,null,null,null,1.0590654107755695,0.92399687078327819,0.93241614648956916,0.89390659926212412,0.93813671346632832]
["13Electricity",2036,13,"Electricity",null,null,null,null,null,1.068470134073612,0.92233886603950677,0.93714300624576896,0.90148413861450183,0.94271895691466256]
["14Electricity",2037,14,"Electricity",null,null,null,null,null,1.0762201302996128,0.92533030118338888,0.94485661964913037,0.91082165652319014,0.94954826817201232]
["15Electricity",2038,15,"Electricity",null,null,null,null,null,1.0879365832294732,0.93006653744726497,0.95481011687414885,0.92203331918195996,0.95885611272420479]
["16Electricity",2039,16,"Electricity",null,null,null,null,null,1.1010243135235127,0.93918408409265985,0.96018434569189481,0.93182764230163784,0.96667232861261865]
["17Electricity",2040,17,"Electricity",null,null,null,null,null,1.1096651936835682,0.95085398127697174,0.96493345865440427,0.93989496388154936,0.9737447414697985]
["18Electricity",2041,18,"Electricity",null,null,null,null,null,1.1182263485887418,0.95744490716477115,0.96825239778570993,0.94907380726890966,0.97974470736420372]
["19Electricity",2042,19,"Electricity",null,null,null,null,null,1.1247020587618048,0.95788651898116606,0.97039932423938202,0.95699045465323618,0.98353699455331811]
["20Electricity",2043,20,"Electricity",null,null,null,null,null,1.1296603358137347,0.95572643702425963,0.97166198307215379,0.9645589342359413,0.98594391877058207]
["21Electricity",2044,21,"Electricity",null,null,null,null,null,1.1280192429828715,0.95491828467211382,0.97327768756680666,0.97340569043555225,0.98781322963162077]
["22Electricity",2045,22,"Electricity",null,null,null,null,null,1.1274170933658152,0.95562735090338935,0.97420172428446994,0.98259960897921395,0.98988090645224458]
["23Electricity",2046,23,"Electricity",null,null,null,null,null,1.12714272621836,0.95170781330893173,0.97080524494078035,0.99083640381687654,0.98919470405101773]
["24Electricity",2047,24,"Electricity",null,null,null,null,null,1.1249981792597004,0.94466413544164352,0.9670213472000877,0.99547424770603277,0.98667106862355047]
["25Electricity",2048,25,"Electricity",null,null,null,null,null,1.1243752551884885,0.94191857721462036,0.96331482273856495,1.000108828427382,0.98486930508815818]
["26Electricity",2049,26,"Electricity",null,null,null,null,null,1.1138419336052321,0.93585328109193611,0.95989776698125107,1.0030568524386769,0.98114179038969163]
["27Electricity",2050,27,"Electricity",null,null,null,null,null,1.1048927951533707,0.92720506887958498,0.95118278823658775,1.0051084138858204,0.97452400922807725]
["28Electricity",2051,28,"Electricity",null,null,null,null,null,1.099468237968555,0.92162527798568761,0.94475985509350102,1.0087487478964019,0.97006819293183322]
["29Electricity",2052,29,"Electricity",null,null,null,null,null,1.0946702638272923,0.91607906549581819,0.93970814202261144,1.0129567920772675,0.96657332465393087]
["30Electricity",2053,30,"Electricity",null,null,null,null,null,1.0898932275858846,0.91056622933982045,0.93468344090064537,1.017182390317918,0.96309104735094031]
["0Propane",2023,0,"Propane",null,null,null,null,null,1,1,1,1,1]
["1Propane",2024,1,"Propane",null,null,null,null,null,1.0241384221327539,1.0241384221327539,1.0241156468363914,1.0230244088275893,1.0225914258945417]
["2Propane",2025,2,"Propane",null,null,null,null,null,0.99992079823416569,0.99992079823416569,0.99983927578317788,0.9984701685970151,0.9977519222741168]
["3Propane",{"$f":"B68","v":2026},3,"Propane",null,null,null,null,null,0.96422304288280603,0.96422304288280603,0.96420233816652279,0.96304835584401083,0.96223177280540029]
["4Propane",2027,4,"Propane",null,null,null,null,null,0.93355050788638172,0.93355050788638172,0.93359619614721001,0.9326200316050387,0.93177488119050389]
["5Propane",2028,5,"Propane",null,null,null,null,null,0.9139214508926975,0.9139214508926975,0.91403058810101789,0.9131031703876481,0.91231928014389607]
["6Propane",2029,6,"Propane",null,null,null,null,null,0.9050800441651341,0.9050800441651341,0.90525470263590846,0.9042516755187644,0.90359211033896314]
["7Propane",2030,7,"Propane",null,null,null,null,null,0.90566522594711785,0.90566522594711785,0.90590248500647819,0.90472467163879389,0.90423453339852045]
["8Propane",2031,8,"Propane",null,null,null,null,null,0.91341456669928289,0.91341456669928289,0.91372345067470673,0.91226092544246129,0.91198392140332729]
["9Propane",2032,9,"Propane",null,null,null,null,null,0.92708069868383125,0.92708069868383125,0.92746529970789815,0.92562041898224612,0.92559941030092407]
["10Propane",2033,10,"Propane",null,null,null,null,null,0.94525122318749144,0.94525122318749144,0.9457200260301003,0.94342561207875375,0.94371062039872455]
["11Propane",2034,11,"Propane",null,null,null,null,null,0.96446582234994216,0.96446582234994216,0.9650212018136024,0.96226126106868259,0.96286170396331028]
["12Propane",2035,12,"Propane",null,null,null,null,null,0.98083210575350221,0.98083210575350221,0.98147616024628703,0.97828506348502164,0.97917920700305439]
["13Propane",2036,13,"Propane",null,null,null,null,null,0.99334430136468987,0.99334430136468987,0.99407767866786556,0.99051258041591295,0.99167872725069239]
["14Propane",2037,14,"Propane",null,null,null,null,null,1.0039400059694648,1.0039400059694648,1.0047654669382118,1.0008712437542604,1.0022998626226656]
["15Propane",2038,15,"Propane",null,null,null,null,null,1.0164412686095163,1.0164412686095163,1.0173645951494965,1.0131174758312005,1.0148290509214055]
["16Propane",2039,16,"Propane",null,null,null,null,null,1.0245968871510003,1.0245968871510003,1.0256216009737122,1.021084378445011,1.0230407828157486]
["17Propane",2040,17,"Propane",null,null,null,null,null,1.0340668647614659,1.0340668647614659,1.0351927174125322,1.0303537378873688,1.0325756714006962]
["18Propane",2041,18,"Propane",null,null,null,null,null,1.0443945636027103,1.0443945636027103,1.045623601059368,1.0404742772787023,1.0429787233818126]
["19Propane",2042,19,"Propane",null,null,null,null,null,1.0524445704867436,1.0524445704867436,1.0537751603087704,1.0483516471054155,1.0511197599773974]
["20Propane",2043,20,"Propane",null,null,null,null,null,1.0570602369986808,1.0570602369986808,1.0584886423105606,1.0528491335810979,1.0558555438615191]
["21Propane",2044,21,"Propane",null,null,null,null,null,1.0586472730932293,1.0586472730932293,1.0601732772382908,1.0543706834817048,1.0575985439898876]
["22Propane",2045,22,"Propane",null,null,null,null,null,1.0602971330270552,1.0602971330270552,1.0619194213454679,1.0573361850681946,1.0596617298683952]
["23Propane",2046,23,"Propane",null,null,null,null,null,1.0612973623328255,1.0612973623328255,1.0630133627111888,1.0849084190407647,1.0655435661419133]
["24Propane",2047,24,"Propane",null,null,null,null,null,1.0623403681006627,1.0623403681006627,1.0641527886866877,1.0945935135443363,1.0682943912296721]
["25Propane",2048,25,"Propane",null,null,null,null,null,1.0645717705464297,1.0645717705464297,1.0664794959399175,1.096638909505822,1.0707061657564534]
["26Propane",2049,26,"Propane",null,null,null,null,null,1.0657896179712976,1.0657896179712976,1.0677882029144101,1.0978007319710439,1.0721428028504358]
["27Propane",2050,27,"Propane",null,null,null,null,null,1.0655309936492536,1.0655309936492536,1.0676173799713495,1.0975437921934124,1.0721220225986727]
["28Propane",2051,28,"Propane",null,null,null,null,null,1.0660746334766653,1.0660746334766653,1.0682524525253643,1.1034614285369622,1.0738116554156947]
["29Propane",2052,29,"Propane",null,null,null,null,null,1.0669995254762428,1.0669995254762428,1.0692703524766529,1.111599717741494,1.0761881826034503]
["30Propane",2053,30,"Propane",null,null,null,null,null,1.0679252198823159,1.0679252198823159,1.0702892223487768,1.119798028755093,1.0785699694486564]
["0Wood",2023,0,"Wood",null,null,null,null,null,1,1,1,1,1]
["1Wood",2024,1,"Wood",null,null,null,null,null,1,1,1,1,1]
["2Wood",2025,2,"Wood",null,null,null,null,null,1,1,1,1,1]
["3Wood",2026,3,"Wood",null,null,null,null,null,1,1,1,1,1]
[{"$f":"C131&D131","v":"4Wood"},2027,4,"Wood",null,null,null,null,null,1,1,1,1,1]
["5Wood",2028,5,"Wood",null,null,null,null,null,1,1,1,1,1]
["6Wood",2029,6,"Wood",null,null,null,null,null,1,1,1,1,1]
["7Wood",2030,7,"Wood",null,null,null,null,null,1,1,1,1,1]
["8Wood",2031,8,"Wood",null,null,null,null,null,1,1,1,1,1]
["9Wood",2032,9,"Wood",null,null,null,null,null,1,1,1,1,1]
["10Wood",2033,10,"Wood",null,null,null,null,null,1,1,1,1,1]
["11Wood",2034,11,"Wood",null,null,null,null,null,1,1,1,1,1]
["12Wood",2035,12,"Wood",null,null,null,null,null,1,1,1,1,1]
["13Wood",2036,13,"Wood",null,null,null,null,null,1,1,1,1,1]
["14Wood",2037,14,"Wood",null,null,null,null,null,1,1,1,1,1]
["15Wood",2038,15,"Wood",null,null,null,null,null,1,1,1,1,1]
["16Wood",2039,16,"Wood",null,null,null,null,null,1,1,1,1,1]
["17Wood",2040,17,"Wood",null,null,null,null,null,1,1,1,1,1]
["18Wood",2041,18,"Wood",null,null,null,null,null,1,1,1,1,1]
["19Wood",2042,19,"Wood",null,null,null,null,null,1,1,1,1,1]
["20Wood",2043,20,"Wood",null,null,null,null,null,1,1,1,1,1]
["21Wood",2044,21,"Wood",null,null,null,null,null,1,1,1,1,1]
["22Wood",2045,22,"Wood",null,null,null,null,null,1,1,1,1,1]
["23Wood",2046,23,"Wood",null,null,null,null,null,1,1,1,1,1]
["24Wood",2047,24,"Wood",null,null,null,null,null,1,1,1,1,1]
["25Wood",2048,25,"Wood",null,null,null,null,null,1,1,1,1,1]
["26Wood",2049,26,"Wood",null,null,null,null,null,1,1,1,1,1]
["27Wood",2050,27,"Wood",null,null,null,null,null,1,1,1,1,1]
["28Wood",2051,28,"Wood",null,null,null,null,null,1,1,1,1,1]
["29Wood",2052,29,"Wood",null,null,null,null,null,1,1,1,1,1]
["30Wood",2053,30,"Wood",null,null,null,null,null,1,1,1,1,1]
["0Coal",2023,0,"Coal",null,null,null,null,null,1,1,1,1,1]
["1Coal",2024,1,"Coal",null,null,null,null,null,1.01568585037124,1.0036536130148517,1.0475850075417477,0.99958037539727507,1.0153251486886714]
["2Coal",2025,2,"Coal",null,null,null,null,null,1.040152813857111,1.0277511223677895,1.0784827197023337,1.0154324603239135,1.0393671615931128]
["3Coal",2026,3,"Coal",null,null,null,null,null,1.0348863202544731,1.0307393819835668,1.0804712576461009,1.0230917597032092,1.0430362286534904]
["4Coal",2027,4,"Coal",null,null,null,null,null,1.0477140909162332,1.0215035867404061,1.0799665451140612,1.0199693294193084,1.0378285623486203]
["5Coal",{"$f":"B132","v":2028},5,"Coal",null,null,null,null,null,1.0508356068513309,1.0118634519851475,1.0804678264221377,1.0125766577111781,1.0313251183952576]
["6Coal",2029,6,"Coal",null,null,null,null,null,1.0502411355332844,1.0067238415070536,1.0826151068431977,1.0072756330471637,1.0269835746012648]
["7Coal",2030,7,"Coal",null,null,null,null,null,1.0517440829732727,1.0045285333290908,1.0857930893389567,1.0031508877058128,1.0244063287019636]
["8Coal",2031,8,"Coal",null,null,null,null,null,1.0546419446787891,1.0030915400868783,1.0901121994443004,0.998864722589065,1.0225321341018216]
["9Coal",2032,9,"Coal",null,null,null,null,null,1.0579766860690853,1.0015765717065879,1.0937028744375135,0.99395382073894578,1.0203324301887111]
["10Coal",2033,10,"Coal",null,null,null,null,null,1.0625147528097136,1.000728654451204,1.1005755439817615,0.98999259627037806,1.0196127533773625]
["11Coal",2034,11,"Coal",null,null,null,null,null,1.0688932724951512,1.0016539728303935,1.106191697086329,0.98754377488635114,1.0198459061284388]
["12Coal",2035,12,"Coal",null,null,null,null,null,1.075742439528228,1.0033992355919468,1.1106905809796501,0.98550263565661222,1.0204113169857358]
["13Coal",2036,13,"Coal",null,null,null,null,null,1.0829948054844705,1.0068133913891975,1.1152219418735472,0.983826355068257,1.0216176467047307]
["14Coal",2037,14,"Coal",null,null,null,null,null,1.0919719773315566,1.0139712148102058,1.1202269892034273,0.98293976559455631,1.02487944781616]
["15Coal",2038,15,"Coal",null,null,null,null,null,1.1002869354202762,1.0244172530029669,1.1239344648342429,0.98280573923407222,1.0294428755637393]
["16Coal",2039,16,"Coal",null,null,null,null,null,1.1071693603444048,1.0325313734306067,1.1283393027305979,0.98242345287969679,1.0328592920754047]
["17Coal",2040,17,"Coal",null,null,null,null,null,1.1118222225519592,1.0368646568919406,1.1319011864858606,0.98069830369882582,1.0342589000387612]
["18Coal",2041,18,"Coal",null,null,null,null,null,1.0366767427754122,1.0400885819142507,1.1351908343232973,0.97898990127258756,1.0350941735170089]
["19Coal",2042,19,"Coal",null,null,null,null,null,1.010544294192365,1.0426288608369241,1.1377774128460323,0.97734247820694897,1.0352821984217331]
["20Coal",2043,20,"Coal",null,null,null,null,null,1.0101216764497611,1.0456394198498755,1.1411368918574054,0.97725979661604001,1.0359797002515072]
["21Coal",2044,21,"Coal",null,null,null,null,null,1.0102722111524542,1.0486443980090272,1.1421952681111931,0.97796753592336461,1.0360900507745143]
["22Coal",2045,22,"Coal",null,null,null,null,null,1.0105255940259841,1.0514738276003974,1.1451614898910085,0.97985988033346649,1.0370172880638784]
["23Coal",2046,23,"Coal",null,null,null,null,null,1.0105703064908704,1.0574233067436503,1.1486228048291001,0.9801098274443335,1.0382722380276597]
["24Coal",2047,24,"Coal",null,null,null,null,null,1.0104474980166627,1.0621537427186725,1.1506928275796402,0.980564916387616,1.0397321310896048]
["25Coal",2048,25,"Coal",null,null,null,null,null,1.0103224523689882,1.0595872860517408,1.1492040351463266,0.98148075122989853,1.0415053931382361]
["26Coal",2049,26,"Coal",null,null,null,null,null,1.0102832913257254,1.0540942055883573,1.1496884302069921,0.98199346216941363,1.0410829984270042]
["27Coal",2050,27,"Coal",null,null,null,null,null,1.0101589471513552,1.0532286334568379,1.1524024614639963,0.98155986475863388,1.0408920725017203]
["28Coal",2051,28,"Coal",null,null,null,null,null,1.0100462105087842,1.0536129097298039,1.1542460922580136,0.98152973322541404,1.0414663197094236]
["29Coal",2052,29,"Coal",null,null,null,null,null,1.0099496853589118,1.0538732918633349,1.1556638590434807,0.98172216242250709,1.0421860671818588]
["30Coal",2053,30,"Coal",null,null,null,null,null,1.0098531694334736,1.0541337383457883,1.1570833672796417,0.98191462934540152,1.0429063120649296]
["0Kerosene",2023,0,"Kerosene",null,null,null,null,null,{"$f":"J34","v":1},1,1,1,1]
["1Kerosene",2024,1,"Kerosene",null,null,null,null,null,0.95641932603800695,0.9353292595307855,0.95806442189507024,0.9596828259813811,0.95506661711657392]
["2Kerosene",2025,2,"Kerosene",null,null,null,null,null,0.91156265728575148,0.86846671501349892,0.91388472581688673,0.91330895166801818,0.90901072496357682]
["3Kerosene",2026,3,"Kerosene",null,null,null,null,null,{"$f":"J37","v":0.88989565610075783},0.83184005561361607,0.89168725478682809,0.88964723820021419,0.88652165334099065]
["4Kerosene",2027,4,"Kerosene",null,null,null,null,null,0.87706022837128084,0.80763506842701827,0.87838722985800644,0.87526585386183964,0.87299663311774434]
["5Kerosene",2028,5,"Kerosene",null,null,null,null,null,0.86833090932567103,0.78639708909870487,0.86737262313832431,0.86232679786134725,0.86330341660264731]
[{"$f":"C195&D195","v":"6Kerosene"},2029,6,"Kerosene",null,null,null,null,null,0.86860655438991574,0.78434461971313663,0.86650018544100105,0.86097861362888795,0.86316153855228761]
["7Kerosene",2030,7,"Kerosene",null,null,null,null,null,0.86967857623343481,0.78475918565735236,0.8672963702855867,0.86205559858561076,0.86400039858580258]
["8Kerosene",2031,8,"Kerosene",null,null,null,null,null,0.87387923196846662,0.78999456262496248,0.87141031592369922,0.86547726425671789,0.86801610086120506]
["9Kerosene",2032,9,"Kerosene",null,null,null,null,null,0.87734613071906187,0.79401011859788151,0.8744488633709262,0.86933002324909658,0.87129063159137754]
["10Kerosene",2033,10,"Kerosene",null,null,null,null,null,0.88095828290480493,0.79695345754897251,0.87676851083150742,0.87135834742203488,0.87454544990224614]
["11Kerosene",2034,11,"Kerosene",null,null,null,null,null,0.88291356108362296,0.80064422983108707,0.87944879111358032,0.87396763122519694,0.87644323911595723]
["12Kerosene",2035,12,"Kerosene",null,null,null,null,null,0.88758033783755308,0.80406646997962217,0.88219823576104273,0.87693841076462198,0.88067295797765599]
["13Kerosene",2036,13,"Kerosene",null,null,null,null,null,0.88932123889568238,0.80742636393635958,0.88463226048212318,0.87942932981491606,0.88234212867501494]
["14Kerosene",2037,14,"Kerosene",null,null,null,null,null,0.89238216244834845,0.81128671178876166,0.88751805591206145,0.88183042675171408,0.88519454679793641]
["15Kerosene",2038,15,"Kerosene",null,null,null,null,null,0.89551331069502804,0.81490324746504861,0.8902574455694664,0.88458739626402361,0.88809939431059459]
["16Kerosene",2039,16,"Kerosene",null,null,null,null,null,0.89727959745083274,0.81739596817851523,0.89212520937837336,0.88667469890902706,0.88970368765637908]
["17Kerosene",2040,17,"Kerosene",null,null,null,null,null,0.89876356249846956,0.81994191028148922,0.89399485617984853,0.8889455339191682,0.89107356059177689]
["18Kerosene",2041,18,"Kerosene",null,null,null,null,null,0.90273408281967038,0.82572969903027815,0.89828113308461544,0.89329553387332161,0.89493583419689493]
["19Kerosene",2042,19,"Kerosene",null,null,null,null,null,{"$f":"J53","v":0.90387304208654806},0.82801347093452038,0.89993502152153781,0.89486521688636955,0.89595555955012063]
["20Kerosene",2043,20,"Kerosene",null,null,null,null,null,0.90650983017829623,0.83192858691918081,0.90283037849069225,0.89775335639638043,0.89844893642050816]
["21Kerosene",2044,21,"Kerosene",null,null,null,null,null,0.90543192188740906,0.83076608921698025,0.90196358245682806,0.89710097763432051,0.89718309282135889]
["22Kerosene",2045,22,"Kerosene",null,null,null,null,null,0.90568122831570397,0.8335018627565618,0.90384059132855354,0.8988804625100687,0.89746169650561047]
["23Kerosene",2046,23,"Kerosene",null,null,null,null,null,0.9106420673108151,0.84158212585202252,0.90976453405329272,0.90764854615200052,0.90250204464234685]
["24Kerosene",2047,24,"Kerosene",null,null,null,null,null,0.9130151574608496,0.84437881471471299,0.91179802636425322,0.9108789428130577,0.90467281596441484]
["25Kerosene",2048,25,"Kerosene",null,null,null,null,null,{"$f":"J59","v":0.9141554345784213},0.84592966256281732,0.91280807961370958,0.91189630607860472,0.90558870018895321]
["26Kerosene",2049,26,"Kerosene",null,null,null,null,null,0.91606634768138229,0.84872743848602639,0.91489582289535021,0.91371879862471594,0.90730304843743104]
["27Kerosene",2050,27,"Kerosene",null,null,null,null,null,0.91678284882491301,0.84983807429369662,0.91572990484590533,0.91430025147387284,0.90779744970412424]
["28Kerosene",2051,28,"Kerosene",null,null,null,null,null,0.91848320853748633,0.85226681472767363,0.91749469747452095,0.91655010305897155,0.90931117675802131]
["29Kerosene",2052,29,"Kerosene",null,null,null,null,null,0.92067693660507088,0.85536776312658047,0.91974698894697526,0.9195289521830825,0.91133242515272339]
["30Kerosene",2053,30,"Kerosene",null,null,null,null,null,0.92287590422716215,0.85847999423743437,0.9220048094071075,0.92251748276604073,0.91335816644840095]
["0Other",2023,0,"Other",null,null,null,null,null,1,1,1,1,1]
["1Other",2024,1,"Other",null,null,null,null,null,1,1,1,1,1]
["2Other",2025,2,"Other",null,null,null,null,null,1,1,1,1,1]
["3Other",2026,3,"Other",null,null,null,null,null,1,1,1,1,1]
["4Other",2027,4,"Other",null,null,null,null,null,1,1,1,1,1]
["5Other",2028,5,"Other",null,null,null,null,null,1,1,1,1,1]
["6Other",2029,6,"Other",null,null,null,null,null,1,1,1,1,1]
["7Other",{"$f":"B196","v":2030},7,"Other",null,null,null,null,null,1,1,1,1,1]
["8Other",2031,8,"Other",null,null,null,null,null,1,1,1,1,1]
["9Other",2032,9,"Other",null,null,null,null,null,1,1,1,1,1]
["10Other",2033,10,"Other",null,null,null,null,null,1,1,1,1,1]
["11Other",2034,11,"Other",null,null,null,null,null,1,1,1,1,1]
["12Other",2035,12,"Other",null,null,null,null,null,1,1,1,1,1]
["13Other",2036,13,"Other",null,null,null,null,null,1,1,1,1,1]
["14Other",2037,14,"Other",null,null,null,null,null,1,1,1,1,1]
["15Other",2038,15,"Other",null,null,null,null,null,1,1,1,1,1]
["16Other",2039,16,"Other",null,null,null,null,null,1,1,1,1,1]
["17Other",2040,17,"Other",null,null,null,null,null,1,1,1,1,1]
["18Other",2041,18,"Other",null,null,null,null,null,1,1,1,1,1]
["19Other",2042,19,"Other",null,null,null,null,null,1,1,1,1,1]
["20Other",2043,20,"Other",null,null,null,null,null,1,1,1,1,1]
["21Other",2044,21,"Other",null,null,null,null,null,1,1,1,1,1]
["22Other",2045,22,"Other",null,null,null,null,null,1,1,1,1,1]
["23Other",2046,23,"Other",null,null,null,null,null,1,1,1,1,1]
["24Other",2047,24,"Other",null,null,null,null,null,1,1,1,1,1]
["25Other",2048,25,"Other",null,null,null,null,null,1,1,1,1,1]
["26Other",2049,26,"Other",null,null,null,null,null,1,1,1,1,1]
["27Other",2050,27,"Other",null,null,null,null,null,1,1,1,1,1]
["28Other",2051,28,"Other",null,null,null,null,null,1,1,1,1,1]
["29Other",2052,29,"Other",null,null,null,null,null,1,1,1,1,1]
["30Other",2053,30,"Other",null,null,null,null,null,1,1,1,1,1]

{"sheet":"User Inputs_FPI_Calculator","index":1,"n_rows":250,"n_cols":34,"rows_kept":250,"cut":false,"hidden":false,"merged":[[0,31,0,33],[8,3,9,3],[8,2,9,2],[0,1,0,11],[0,27,0,29],[4,2,4,3],[2,4,2,6],[4,4,4,6],[1,24,1,25],[0,24,0,25]]}
[null,"FPI Calculator\nSCC-Inclusive Fuel Price Index Calculator: Enhancing WA with Non-Energy Benefits",null,null,null,null,null,null,null,null,null,null,null,null,null,"FPI for v8.9 (adjusted for 30 yr UPV)","FPI_SCC for v8.9 (adjusted for 30 year UPV)",null,null,null,"FPI for v10","FPI_SCC for v10",null,null,{"$f":"H9","v":"Modified fuel price"},null,null,{"$f":"INDEX(P1:V1,MATCH(E3, P1:V1,0))","v":"FPI_SCC for v8.9 (adjusted for 30 year UPV)"},null,null,null,{"$f":"AB1&\" : \" & AD2","v":"FPI_SCC for v8.9 (adjusted for 30 year UPV) : Region 4 - West"}]
[null,null,null,null,null,null,null,null,null,null,null,null,null,"Year","Fuel Type",{"$f":"'User Inputs_FPI_Calculator'!$I$5","v":"Region 4 - West"},{"$f":"'User Inputs_FPI_Calculator'!$I$5","v":"Region 4 - West"},null,"Year","Fuel Type",{"$f":"'User Inputs_FPI_Calculator'!$I$5","v":"Region 4 - West"},{"$f":"'User Inputs_FPI_Calculator'!$I$5","v":"Region 4 - West"},null,null,{"$f":"H10","v":"$/fuel unit"},null,null,{"$f":"S2","v":"Year"},{"$f":"T2","v":"Fuel Type"},{"$f":" V2","v":"Region 4 - West"},null,{"$f":"AC2","v":"Fuel Type"},{"$f":"AB2","v":"Year"},{"$f":"AD2","v":"Region 4 - West"}]
[null,"Step 1","Select Calculator Output",null,"FPI_SCC for v8.9 (adjusted for 30 year UPV)",null,null,null,null,null,null,null,null,0,"Natural Gas",{"$f":"INDEX(Calculator!$D$6:$CM$36,MATCH($N3&P$2,Calculator!$A$6:$A$36,0),MATCH(P$1&$O3,Calculator!$D$2:$CM$2,0))","v":1},{"$f":"INDEX(Calculator!$D$6:$CM$36,MATCH($N3&Q$2,Calculator!$A$6:$A$36,0),MATCH(Q$1&$O3,Calculator!$D$2:$CM$2,0))","v":1},null,0,"Electricity",{"$f":"INDEX(Calculator!$D$6:$CM$36,MATCH($S3&U$2,Calculator!$A$6:$A$36,0),MATCH(U$1&$T3,Calculator!$D$2:$CM$2,0))","v":1},{"$f":"INDEX(Calculator!$D$6:$CM$36,MATCH($S3&V$2,Calculator!$A$6:$A$36,0),MATCH(V$1&$T3,Calculator!$D$2:$CM$2,0))","v":1},null,null,{"$f":"C11","v":"Natural Gas"},{"$f":"H11","v":18.277986509999998},null,{"$f":"IF(OR($AB$1=\"FPI for v10\", $AB$1=\"FPI_SCC for v10\"), $S3, $N3)","v":0},{"$f":"IF(OR($AB$1=\"FPI for v10\", $AB$1=\"FPI_SCC for v10\"), $T3, $O3)","v":"Natural Gas"},{"$f":"INDEX(P3:V3,0, MATCH($AB$1,$P$1:$V$1,0))","v":1},null,{"$f":"AC3","v":"Natural Gas"},{"$f":"AB3","v":0},{"$f":"AD3","v":1}]
[null,null,null,null,null,null,null,null,null,null,null,null,null,1,"Natural Gas",{"$f":"INDEX(Calculator!$D$6:$CM$36,MATCH($N4&P$2,Calculator!$A$6:$A$36,0),MATCH(P$1&$O4,Calculator!$D$2:$CM$2,0))","v":0.98031290628534118},{"$f":"INDEX(Calculator!$D$6:$CM$36,MATCH($N4&Q$2,Calculator!$A$6:$A$36,0),MATCH(Q$1&$O4,Calculator!$D$2:$CM$2,0))","v":0.98644692290046421},null,1,"Electricity",{"$f":"INDEX(Calculator!$D$6:$CM$36,MATCH($S4&U$2,Calculator!$A$6:$A$36,0),MATCH(U$1&$T4,Calculator!$D$2:$CM$2,0))","v":0.9348597229818798},{"$f":"INDEX(Calculator!$D$6:$CM$36,MATCH($S4&V$2,Calculator!$A$6:$A$36,0),MATCH(V$1&$T4,Calculator!$D$2:$CM$2,0))","v":0.94013512917764552},null,null,"Oil",{"$f":"H12","v":4.1200700000000001},null,1,"Natural Gas",{"$f":"INDEX(P4:V4,0, MATCH($AB$1,$P$1:$V$1,0))","v":0.98644692290046421},null,{"$f":"AC4","v":"Natural Gas"},{"$f":"AB4","v":1},{"$f":"AD4","v":0.98644692290046421}]
[null,"Step 2","Select State",null,"Alaska",null,null,null,{"$f":"VLOOKUP(E5,States!A2:B53,2,FALSE)","v":"Region 4 - West"},null,null,null,null,2,"Natural Gas",{"$f":"INDEX(Calculator!$D$6:$CM$36,MATCH($N5&P$2,Calculator!$A$6:$A$36,0),MATCH(P$1&$O5,Calculator!$D$2:$CM$2,0))","v":0.91127274490115895},{"$f":"INDEX(Calculator!$D$6:$CM$36,MATCH($N5&Q$2,Calculator!$A$6:$A$36,0),MATCH(Q$1&$O5,Calculator!$D$2:$CM$2,0))","v":0.93139274010388873},null,2,"Electricity",{"$f":"INDEX(Calculator!$D$6:$CM$36,MATCH($S5&U$2,Calculator!$A$6:$A$36,0),MATCH(U$1&$T5,Calculator!$D$2:$CM$2,0))","v":0.86722030620246682},{"$f":"INDEX(Calculator!$D$6:$CM$36,MATCH($S5&V$2,Calculator!$A$6:$A$36,0),MATCH(V$1&$T5,Calculator!$D$2:$CM$2,0))","v":0.87158944043772812},null,null,"Electricity",0.1699,null,2,"Natural Gas",{"$f":"INDEX(P5:V5,0, MATCH($AB$1,$P$1:$V$1,0))","v":0.93139274010388873},null,"Natural Gas",2,0.93139274010388873]
[null,null,"Skip step 3 & 4 for FPI without SCC and go to step 5",null,null,null,null,null,null,null,null,null,null,3,"Natural Gas",{"$f":"INDEX(Calculator!$D$6:$CM$36,MATCH($N6&P$2,Calculator!$A$6:$A$36,0),MATCH(P$1&$O6,Calculator!$D$2:$CM$2,0))","v":0.83484140401895668},{"$f":"INDEX(Calculator!$D$6:$CM$36,MATCH($N6&Q$2,Calculator!$A$6:$A$36,0),MATCH(Q$1&$O6,Calculator!$D$2:$CM$2,0))","v":0.87012329782988573},null,3,"Electricity",{"$f":"INDEX(Calculator!$D$6:$CM$36,MATCH($S6&U$2,Calculator!$A$6:$A$36,0),MATCH(U$1&$T6,Calculator!$D$2:$CM$2,0))","v":0.84483048522146464},{"$f":"INDEX(Calculator!$D$6:$CM$36,MATCH($S6&V$2,Calculator!$A$6:$A$36,0),MATCH(V$1&$T6,Calculator!$D$2:$CM$2,0))","v":0.84946776211430075},null,null,"Propane",2.69475,null,3,"Natural Gas",{"$f":"INDEX(P6:V6,0, MATCH($AB$1,$P$1:$V$1,0))","v":0.87012329782988573},null,"Natural Gas",3,0.87012329782988573]
[null,"Step 3","Enter heat content and fuel price only if FPI_SCC are sought. Else go directly to step 5",null,null,null,null,null,null,null,null,null,null,4,"Natural Gas",{"$f":"INDEX(Calculator!$D$6:$CM$36,MATCH($N7&P$2,Calculator!$A$6:$A$36,0),MATCH(P$1&$O7,Calculator!$D$2:$CM$2,0))","v":0.77109079382382839},{"$f":"INDEX(Calculator!$D$6:$CM$36,MATCH($N7&Q$2,Calculator!$A$6:$A$36,0),MATCH(Q$1&$O7,Calculator!$D$2:$CM$2,0))","v":0.81951711053496357},null,4,"Electricity",{"$f":"INDEX(Calculator!$D$6:$CM$36,MATCH($S7&U$2,Calculator!$A$6:$A$36,0),MATCH(U$1&$T7,Calculator!$D$2:$CM$2,0))","v":0.83991193264594588},{"$f":"INDEX(Calculator!$D$6:$CM$36,MATCH($S7&V$2,Calculator!$A$6:$A$36,0),MATCH(V$1&$T7,Calculator!$D$2:$CM$2,0))","v":0.84512530839842193},null,null,"Wood",380.42228,null,4,"Natural Gas",{"$f":"INDEX(P7:V7,0, MATCH($AB$1,$P$1:$V$1,0))","v":0.81951711053496357},null,"Natural Gas",4,0.81951711053496357]
[null,null,null,null,null,null,null,null,null,null,null,null,null,5,"Natural Gas",{"$f":"INDEX(Calculator!$D$6:$CM$36,MATCH($N8&P$2,Calculator!$A$6:$A$36,0),MATCH(P$1&$O8,Calculator!$D$2:$CM$2,0))","v":0.71793289757727208},{"$f":"INDEX(Calculator!$D$6:$CM$36,MATCH($N8&Q$2,Calculator!$A$6:$A$36,0),MATCH(Q$1&$O8,Calculator!$D$2:$CM$2,0))","v":0.7808202045643523},null,5,"Electricity",{"$f":"INDEX(Calculator!$D$6:$CM$36,MATCH($S8&U$2,Calculator!$A$6:$A$36,0),MATCH(U$1&$T8,Calculator!$D$2:$CM$2,0))","v":0.83783409529617092},{"$f":"INDEX(Calculator!$D$6:$CM$36,MATCH($S8&V$2,Calculator!$A$6:$A$36,0),MATCH(V$1&$T8,Calculator!$D$2:$CM$2,0))","v":0.84564516947866752},null,null,"Coal",56.32,null,5,"Natural Gas",{"$f":"INDEX(P8:V8,0, MATCH($AB$1,$P$1:$V$1,0))","v":0.7808202045643523},null,"Natural Gas",5,0.7808202045643523]
[null,null,"      Fuel","Fuel Unit","Fuel Price","Heat Content",null,"Modified fuel price",null,null,null,null,null,6,"Natural Gas",{"$f":"INDEX(Calculator!$D$6:$CM$36,MATCH($N9&P$2,Calculator!$A$6:$A$36,0),MATCH(P$1&$O9,Calculator!$D$2:$CM$2,0))","v":0.70464145203382345},{"$f":"INDEX(Calculator!$D$6:$CM$36,MATCH($N9&Q$2,Calculator!$A$6:$A$36,0),MATCH(Q$1&$O9,Calculator!$D$2:$CM$2,0))","v":0.77264524240858889},null,6,"Electricity",{"$f":"INDEX(Calculator!$D$6:$CM$36,MATCH($S9&U$2,Calculator!$A$6:$A$36,0),MATCH(U$1&$T9,Calculator!$D$2:$CM$2,0))","v":0.83833743588948628},{"$f":"INDEX(Calculator!$D$6:$CM$36,MATCH($S9&V$2,Calculator!$A$6:$A$36,0),MATCH(V$1&$T9,Calculator!$D$2:$CM$2,0))","v":0.84726671797188313},null,null,"Kerosene",3.98007,null,6,"Natural Gas",{"$f":"INDEX(P9:V9,0, MATCH($AB$1,$P$1:$V$1,0))","v":0.77264524240858889},null,"Natural Gas",6,0.77264524240858889]
[null,null,null,null,"$/fuel unit","MMBtu/fuel unit",null,"$/fuel unit",null,null,null,null,null,7,"Natural Gas",{"$f":"INDEX(Calculator!$D$6:$CM$36,MATCH($N10&P$2,Calculator!$A$6:$A$36,0),MATCH(P$1&$O10,Calculator!$D$2:$CM$2,0))","v":0.70591713964079483},{"$f":"INDEX(Calculator!$D$6:$CM$36,MATCH($N10&Q$2,Calculator!$A$6:$A$36,0),MATCH(Q$1&$O10,Calculator!$D$2:$CM$2,0))","v":0.77671981530962486},null,7,"Electricity",{"$f":"INDEX(Calculator!$D$6:$CM$36,MATCH($S10&U$2,Calculator!$A$6:$A$36,0),MATCH(U$1&$T10,Calculator!$D$2:$CM$2,0))","v":0.84362183838221783},{"$f":"INDEX(Calculator!$D$6:$CM$36,MATCH($S10&V$2,Calculator!$A$6:$A$36,0),MATCH(V$1&$T10,Calculator!$D$2:$CM$2,0))","v":0.85075500740042775},null,null,"Other",0,null,7,"Natural Gas",{"$f":"INDEX(P10:V10,0, MATCH($AB$1,$P$1:$V$1,0))","v":0.77671981530962486},null,"Natural Gas",7,0.77671981530962486]
[null,null,"Natural Gas","Mcf",15.37,1.0369999999999999,null,{"$f":"INDEX(Calculator!$AZ$5:$BG$5,1,MATCH('User Inputs_FPI_Calculator'!$C11,Calculator!$AZ$4:$BG$4,0))","v":18.277986509999998},null,null,null,null,null,8,"Natural Gas",{"$f":"INDEX(Calculator!$D$6:$CM$36,MATCH($N11&P$2,Calculator!$A$6:$A$36,0),MATCH(P$1&$O11,Calculator!$D$2:$CM$2,0))","v":0.71119303080644869},{"$f":"INDEX(Calculator!$D$6:$CM$36,MATCH($N11&Q$2,Calculator!$A$6:$A$36,0),MATCH(Q$1&$O11,Calculator!$D$2:$CM$2,0))","v":0.78415816838761399},null,8,"Electricity",{"$f":"INDEX(Calculator!$D$6:$CM$36,MATCH($S11&U$2,Calculator!$A$6:$A$36,0),MATCH(U$1&$T11,Calculator!$D$2:$CM$2,0))","v":0.85237730143056756},{"$f":"INDEX(Calculator!$D$6:$CM$36,MATCH($S11&V$2,Calculator!$A$6:$A$36,0),MATCH(V$1&$T11,Calculator!$D$2:$CM$2,0))","v":0.85789638148666936},null,null,null,null,null,8,"Natural Gas",{"$f":"INDEX(P11:V11,0, MATCH($AB$1,$P$1:$V$1,0))","v":0.78415816838761399},null,"Natural Gas",8,{"$f":"AD11","v":0.78415816838761399}]
[null,null,"Oil","Gallon",3.58,0.13850000000000001,null,{"$f":"INDEX(Calculator!$AZ$5:$BG$5,1,MATCH('User Inputs_FPI_Calculator'!$C12,Calculator!$AZ$4:$BG$4,0))","v":4.1200700000000001},null,null,null,null,null,9,"Natural Gas",{"$f":"INDEX(Calculator!$D$6:$CM$36,MATCH($N12&P$2,Calculator!$A$6:$A$36,0),MATCH(P$1&$O12,Calculator!$D$2:$CM$2,0))","v":0.71696837151239889},{"$f":"INDEX(Calculator!$D$6:$CM$36,MATCH($N12&Q$2,Calculator!$A$6:$A$36,0),MATCH(Q$1&$O12,Calculator!$D$2:$CM$2,0))","v":0.79201650970829895},null,9,"Electricity",{"$f":"INDEX(Calculator!$D$6:$CM$36,MATCH($S12&U$2,Calculator!$A$6:$A$36,0),MATCH(U$1&$T12,Calculator!$D$2:$CM$2,0))","v":0.86307059287030707},{"$f":"INDEX(Calculator!$D$6:$CM$36,MATCH($S12&V$2,Calculator!$A$6:$A$36,0),MATCH(V$1&$T12,Calculator!$D$2:$CM$2,0))","v":0.86733719205736348},null,null,null,null,null,9,"Natural Gas",{"$f":"INDEX(P12:V12,0, MATCH($AB$1,$P$1:$V$1,0))","v":0.79201650970829895},null,"Natural Gas",9,0.79201650970829895]
[null,null,"Electricity","kWh",0.15,3.4129999999999998E-3,null,{"$f":"INDEX(Calculator!$AZ$5:$BG$5,1,MATCH('User Inputs_FPI_Calculator'!$C13,Calculator!$AZ$4:$BG$4,0))","v":0.1699},null,null,null,null,null,10,"Natural Gas",{"$f":"INDEX(Calculator!$D$6:$CM$36,MATCH($N13&P$2,Calculator!$A$6:$A$36,0),MATCH(P$1&$O13,Calculator!$D$2:$CM$2,0))","v":0.72576281843064205},{"$f":"INDEX(Calculator!$D$6:$CM$36,MATCH($N13&Q$2,Calculator!$A$6:$A$36,0),MATCH(Q$1&$O13,Calculator!$D$2:$CM$2,0))","v":0.80241362423890805},null,10,"Electricity",{"$f":"INDEX(Calculator!$D$6:$CM$36,MATCH($S13&U$2,Calculator!$A$6:$A$36,0),MATCH(U$1&$T13,Calculator!$D$2:$CM$2,0))","v":0.8743015768109712},{"$f":"INDEX(Calculator!$D$6:$CM$36,MATCH($S13&V$2,Calculator!$A$6:$A$36,0),MATCH(V$1&$T13,Calculator!$D$2:$CM$2,0))","v":0.87725271643111047},null,null,null,null,null,10,"Natural Gas",{"$f":"INDEX(P13:V13,0, MATCH($AB$1,$P$1:$V$1,0))","v":0.80241362423890805},null,"Natural Gas",10,0.80241362423890805]
[null,null,"Propane","Gallon",2.39,9.1499999999999998E-2,null,{"$f":"INDEX(Calculator!$AZ$5:$BG$5,1,MATCH('User Inputs_FPI_Calculator'!$C14,Calculator!$AZ$4:$BG$4,0))","v":2.69475},null,null,null,null,null,11,"Natural Gas",{"$f":"INDEX(Calculator!$D$6:$CM$36,MATCH($N14&P$2,Calculator!$A$6:$A$36,0),MATCH(P$1&$O14,Calculator!$D$2:$CM$2,0))","v":0.73548382624922659},{"$f":"INDEX(Calculator!$D$6:$CM$36,MATCH($N14&Q$2,Calculator!$A$6:$A$36,0),MATCH(Q$1&$O14,Calculator!$D$2:$CM$2,0))","v":0.81358988591630232},null,11,"Electricity",{"$f":"INDEX(Calculator!$D$6:$CM$36,MATCH($S14&U$2,Calculator!$A$6:$A$36,0),MATCH(U$1&$T14,Calculator!$D$2:$CM$2,0))","v":0.88463585004845546},{"$f":"INDEX(Calculator!$D$6:$CM$36,MATCH($S14&V$2,Calculator!$A$6:$A$36,0),MATCH(V$1&$T14,Calculator!$D$2:$CM$2,0))","v":0.88814230433942498},null,null,null,null,null,11,"Natural Gas",{"$f":"INDEX(P14:V14,0, MATCH($AB$1,$P$1:$V$1,0))","v":0.81358988591630232},null,"Natural Gas",11,0.81358988591630232]
[null,null,"Wood","Cord",280,20.2,null,{"$f":"INDEX(Calculator!$AZ$5:$BG$5,1,MATCH('User Inputs_FPI_Calculator'!$C15,Calculator!$AZ$4:$BG$4,0))","v":380.42228},null,null,null,null,null,12,"Natural Gas",{"$f":"INDEX(Calculator!$D$6:$CM$36,MATCH($N15&P$2,Calculator!$A$6:$A$36,0),MATCH(P$1&$O15,Calculator!$D$2:$CM$2,0))","v":0.74432053488527972},{"$f":"INDEX(Calculator!$D$6:$CM$36,MATCH($N15&Q$2,Calculator!$A$6:$A$36,0),MATCH(Q$1&$O15,Calculator!$D$2:$CM$2,0))","v":0.82402253842054884},null,12,"Electricity",{"$f":"INDEX(Calculator!$D$6:$CM$36,MATCH($S15&U$2,Calculator!$A$6:$A$36,0),MATCH(U$1&$T15,Calculator!$D$2:$CM$2,0))","v":0.89390659926212412},{"$f":"INDEX(Calculator!$D$6:$CM$36,MATCH($S15&V$2,Calculator!$A$6:$A$36,0),MATCH(V$1&$T15,Calculator!$D$2:$CM$2,0))","v":0.89397286574054513},null,null,null,null,null,12,"Natural Gas",{"$f":"INDEX(P15:V15,0, MATCH($AB$1,$P$1:$V$1,0))","v":0.82402253842054884},null,"Natural Gas",12,0.82402253842054884]
[null,null,"Coal","Short ton",56.32,21,null,{"$f":"INDEX(Calculator!$AZ$5:$BG$5,1,MATCH('User Inputs_FPI_Calculator'!$C16,Calculator!$AZ$4:$BG$4,0))","v":56.32},null,null,null,null,null,13,"Natural Gas",{"$f":"INDEX(Calculator!$D$6:$CM$36,MATCH($N16&P$2,Calculator!$A$6:$A$36,0),MATCH(P$1&$O16,Calculator!$D$2:$CM$2,0))","v":0.74851464443343485},{"$f":"INDEX(Calculator!$D$6:$CM$36,MATCH($N16&Q$2,Calculator!$A$6:$A$36,0),MATCH(Q$1&$O16,Calculator!$D$2:$CM$2,0))","v":0.83055121890129313},null,13,"Electricity",{"$f":"INDEX(Calculator!$D$6:$CM$36,MATCH($S16&U$2,Calculator!$A$6:$A$36,0),MATCH(U$1&$T16,Calculator!$D$2:$CM$2,0))","v":0.90148413861450183},{"$f":"INDEX(Calculator!$D$6:$CM$36,MATCH($S16&V$2,Calculator!$A$6:$A$36,0),MATCH(V$1&$T16,Calculator!$D$2:$CM$2,0))","v":0.89948570213169665},null,null,null,null,null,13,"Natural Gas",{"$f":"INDEX(P16:V16,0, MATCH($AB$1,$P$1:$V$1,0))","v":0.83055121890129313},null,"Natural Gas",13,0.83055121890129313]
[null,null,"Kerosene","Gallon",3.44,0.13189999999999999,null,{"$f":"INDEX(Calculator!$AZ$5:$BG$5,1,MATCH('User Inputs_FPI_Calculator'!$C17,Calculator!$AZ$4:$BG$4,0))","v":3.98007},null,null,null,null,null,14,"Natural Gas",{"$f":"INDEX(Calculator!$D$6:$CM$36,MATCH($N17&P$2,Calculator!$A$6:$A$36,0),MATCH(P$1&$O17,Calculator!$D$2:$CM$2,0))","v":0.75258583376316301},{"$f":"INDEX(Calculator!$D$6:$CM$36,MATCH($N17&Q$2,Calculator!$A$6:$A$36,0),MATCH(Q$1&$O17,Calculator!$D$2:$CM$2,0))","v":0.83997837981443046},null,14,"Electricity",{"$f":"INDEX(Calculator!$D$6:$CM$36,MATCH($S17&U$2,Calculator!$A$6:$A$36,0),MATCH(U$1&$T17,Calculator!$D$2:$CM$2,0))","v":0.91082165652319014},{"$f":"INDEX(Calculator!$D$6:$CM$36,MATCH($S17&V$2,Calculator!$A$6:$A$36,0),MATCH(V$1&$T17,Calculator!$D$2:$CM$2,0))","v":0.90772953783683652},null,null,null,null,null,14,"Natural Gas",{"$f":"INDEX(P17:V17,0, MATCH($AB$1,$P$1:$V$1,0))","v":0.83997837981443046},null,"Natural Gas",14,0.83997837981443046]
[null,null,"Other","MMBtu",null,1,null,{"$f":"INDEX(Calculator!$AZ$5:$BG$5,1,MATCH('User Inputs_FPI_Calculator'!$C18,Calculator!$AZ$4:$BG$4,0))","v":0},null,null,null,null,null,15,"Natural Gas",{"$f":"INDEX(Calculator!$D$6:$CM$36,MATCH($N18&P$2,Calculator!$A$6:$A$36,0),MATCH(P$1&$O18,Calculator!$D$2:$CM$2,0))","v":0.76050682310848683},{"$f":"INDEX(Calculator!$D$6:$CM$36,MATCH($N18&Q$2,Calculator!$A$6:$A$36,0),MATCH(Q$1&$O18,Calculator!$D$2:$CM$2,0))","v":0.84964100190581904},null,15,"Electricity",{"$f":"INDEX(Calculator!$D$6:$CM$36,MATCH($S18&U$2,Calculator!$A$6:$A$36,0),MATCH(U$1&$T18,Calculator!$D$2:$CM$2,0))","v":0.92203331918195996},{"$f":"INDEX(Calculator!$D$6:$CM$36,MATCH($S18&V$2,Calculator!$A$6:$A$36,0),MATCH(V$1&$T18,Calculator!$D$2:$CM$2,0))","v":0.91821658550496765},null,null,null,null,null,15,"Natural Gas",{"$f":"INDEX(P18:V18,0, MATCH($AB$1,$P$1:$V$1,0))","v":0.84964100190581904},null,"Natural Gas",15,0.84964100190581904]
[null,null,null,null,null,null,null,null,null,null,null,null,null,16,"Natural Gas",{"$f":"INDEX(Calculator!$D$6:$CM$36,MATCH($N19&P$2,Calculator!$A$6:$A$36,0),MATCH(P$1&$O19,Calculator!$D$2:$CM$2,0))","v":0.76114530931431823},{"$f":"INDEX(Calculator!$D$6:$CM$36,MATCH($N19&Q$2,Calculator!$A$6:$A$36,0),MATCH(Q$1&$O19,Calculator!$D$2:$CM$2,0))","v":0.85317975071429641},null,16,"Electricity",{"$f":"INDEX(Calculator!$D$6:$CM$36,MATCH($S19&U$2,Calculator!$A$6:$A$36,0),MATCH(U$1&$T19,Calculator!$D$2:$CM$2,0))","v":0.93182764230163784},{"$f":"INDEX(Calculator!$D$6:$CM$36,MATCH($S19&V$2,Calculator!$A$6:$A$36,0),MATCH(V$1&$T19,Calculator!$D$2:$CM$2,0))","v":0.92745230338578988},null,null,null,null,null,16,"Natural Gas",{"$f":"INDEX(P19:V19,0, MATCH($AB$1,$P$1:$V$1,0))","v":0.85317975071429641},null,"Natural Gas",16,0.85317975071429641]
[null,"Step 4","For v8.9 : Copy modified fuel prices and paste in Fuel Cost library of WA",null,null,null,null,null,null,null,null,null,null,17,"Natural Gas",{"$f":"INDEX(Calculator!$D$6:$CM$36,MATCH($N20&P$2,Calculator!$A$6:$A$36,0),MATCH(P$1&$O20,Calculator!$D$2:$CM$2,0))","v":0.76500983620007323},{"$f":"INDEX(Calculator!$D$6:$CM$36,MATCH($N20&Q$2,Calculator!$A$6:$A$36,0),MATCH(Q$1&$O20,Calculator!$D$2:$CM$2,0))","v":0.85943128439233796},null,17,"Electricity",{"$f":"INDEX(Calculator!$D$6:$CM$36,MATCH($S20&U$2,Calculator!$A$6:$A$36,0),MATCH(U$1&$T20,Calculator!$D$2:$CM$2,0))","v":0.93989496388154936},{"$f":"INDEX(Calculator!$D$6:$CM$36,MATCH($S20&V$2,Calculator!$A$6:$A$36,0),MATCH(V$1&$T20,Calculator!$D$2:$CM$2,0))","v":0.9357518810019565},null,null,null,null,null,17,"Natural Gas",{"$f":"INDEX(P20:V20,0, MATCH($AB$1,$P$1:$V$1,0))","v":0.85943128439233796},null,"Natural Gas",17,0.85943128439233796]
[null,null,"For v10 : Type in the modified fuel prices in the Update Fuel Cost Library located in the tab \"Admin Tools\"",null,null,null,null,null,null,null,null,null,null,18,"Natural Gas",{"$f":"INDEX(Calculator!$D$6:$CM$36,MATCH($N21&P$2,Calculator!$A$6:$A$36,0),MATCH(P$1&$O21,Calculator!$D$2:$CM$2,0))","v":0.77077090741299525},{"$f":"INDEX(Calculator!$D$6:$CM$36,MATCH($N21&Q$2,Calculator!$A$6:$A$36,0),MATCH(Q$1&$O21,Calculator!$D$2:$CM$2,0))","v":0.8672776264642148},null,18,"Electricity",{"$f":"INDEX(Calculator!$D$6:$CM$36,MATCH($S21&U$2,Calculator!$A$6:$A$36,0),MATCH(U$1&$T21,Calculator!$D$2:$CM$2,0))","v":0.94907380726890966},{"$f":"INDEX(Calculator!$D$6:$CM$36,MATCH($S21&V$2,Calculator!$A$6:$A$36,0),MATCH(V$1&$T21,Calculator!$D$2:$CM$2,0))","v":0.9438556273710208},null,null,null,null,null,18,"Natural Gas",{"$f":"INDEX(P21:V21,0, MATCH($AB$1,$P$1:$V$1,0))","v":0.8672776264642148},null,"Natural Gas",18,0.8672776264642148]
[null,null,null,null,null,null,null,null,null,null,null,null,null,19,"Natural Gas",{"$f":"INDEX(Calculator!$D$6:$CM$36,MATCH($N22&P$2,Calculator!$A$6:$A$36,0),MATCH(P$1&$O22,Calculator!$D$2:$CM$2,0))","v":0.77365585155398331},{"$f":"INDEX(Calculator!$D$6:$CM$36,MATCH($N22&Q$2,Calculator!$A$6:$A$36,0),MATCH(Q$1&$O22,Calculator!$D$2:$CM$2,0))","v":0.87270542680714147},null,19,"Electricity",{"$f":"INDEX(Calculator!$D$6:$CM$36,MATCH($S22&U$2,Calculator!$A$6:$A$36,0),MATCH(U$1&$T22,Calculator!$D$2:$CM$2,0))","v":0.95699045465323618},{"$f":"INDEX(Calculator!$D$6:$CM$36,MATCH($S22&V$2,Calculator!$A$6:$A$36,0),MATCH(V$1&$T22,Calculator!$D$2:$CM$2,0))","v":0.9520221789169242},null,null,null,null,null,19,"Natural Gas",{"$f":"INDEX(P22:V22,0, MATCH($AB$1,$P$1:$V$1,0))","v":0.87270542680714147},null,"Natural Gas",19,0.87270542680714147]
[null,null,null,null,null,null,null,null,null,null,null,null,null,20,"Natural Gas",{"$f":"INDEX(Calculator!$D$6:$CM$36,MATCH($N23&P$2,Calculator!$A$6:$A$36,0),MATCH(P$1&$O23,Calculator!$D$2:$CM$2,0))","v":0.77337994819727018},{"$f":"INDEX(Calculator!$D$6:$CM$36,MATCH($N23&Q$2,Calculator!$A$6:$A$36,0),MATCH(Q$1&$O23,Calculator!$D$2:$CM$2,0))","v":0.87547526337418469},null,20,"Electricity",{"$f":"INDEX(Calculator!$D$6:$CM$36,MATCH($S23&U$2,Calculator!$A$6:$A$36,0),MATCH(U$1&$T23,Calculator!$D$2:$CM$2,0))","v":0.9645589342359413},{"$f":"INDEX(Calculator!$D$6:$CM$36,MATCH($S23&V$2,Calculator!$A$6:$A$36,0),MATCH(V$1&$T23,Calculator!$D$2:$CM$2,0))","v":0.95929276124420948},null,null,null,null,null,20,"Natural Gas",{"$f":"INDEX(P23:V23,0, MATCH($AB$1,$P$1:$V$1,0))","v":0.87547526337418469},null,"Natural Gas",20,0.87547526337418469]
[null,"Step 5","For v8.9 : Copy modified FPIs",null,null,null,null,null,null,null,null,null,null,21,"Natural Gas",{"$f":"INDEX(Calculator!$D$6:$CM$36,MATCH($N24&P$2,Calculator!$A$6:$A$36,0),MATCH(P$1&$O24,Calculator!$D$2:$CM$2,0))","v":0.7704535908826603},{"$f":"INDEX(Calculator!$D$6:$CM$36,MATCH($N24&Q$2,Calculator!$A$6:$A$36,0),MATCH(Q$1&$O24,Calculator!$D$2:$CM$2,0))","v":0.87901817156262307},null,21,"Electricity",{"$f":"INDEX(Calculator!$D$6:$CM$36,MATCH($S24&U$2,Calculator!$A$6:$A$36,0),MATCH(U$1&$T24,Calculator!$D$2:$CM$2,0))","v":0.97340569043555225},{"$f":"INDEX(Calculator!$D$6:$CM$36,MATCH($S24&V$2,Calculator!$A$6:$A$36,0),MATCH(V$1&$T24,Calculator!$D$2:$CM$2,0))","v":0.96886906159701491},null,null,null,null,null,21,"Natural Gas",{"$f":"INDEX(P24:V24,0, MATCH($AB$1,$P$1:$V$1,0))","v":0.87901817156262307},null,"Natural Gas",21,0.87901817156262307]
[null,null,"And paste in the Economic Parameters Library in v8.9",null,null,null,null,null,null,null,null,null,null,22,"Natural Gas",{"$f":"INDEX(Calculator!$D$6:$CM$36,MATCH($N25&P$2,Calculator!$A$6:$A$36,0),MATCH(P$1&$O25,Calculator!$D$2:$CM$2,0))","v":0.77406313870857735},{"$f":"INDEX(Calculator!$D$6:$CM$36,MATCH($N25&Q$2,Calculator!$A$6:$A$36,0),MATCH(Q$1&$O25,Calculator!$D$2:$CM$2,0))","v":0.88505529277528905},null,22,"Electricity",{"$f":"INDEX(Calculator!$D$6:$CM$36,MATCH($S25&U$2,Calculator!$A$6:$A$36,0),MATCH(U$1&$T25,Calculator!$D$2:$CM$2,0))","v":0.98259960897921395},{"$f":"INDEX(Calculator!$D$6:$CM$36,MATCH($S25&V$2,Calculator!$A$6:$A$36,0),MATCH(V$1&$T25,Calculator!$D$2:$CM$2,0))","v":0.97698611740366148},null,null,null,null,null,22,"Natural Gas",{"$f":"INDEX(P25:V25,0, MATCH($AB$1,$P$1:$V$1,0))","v":0.88505529277528905},null,"Natural Gas",22,0.88505529277528905]
[null,null," ",null,null,null,null,null,null,null,null,null,null,23,"Natural Gas",{"$f":"INDEX(Calculator!$D$6:$CM$36,MATCH($N26&P$2,Calculator!$A$6:$A$36,0),MATCH(P$1&$O26,Calculator!$D$2:$CM$2,0))","v":0.84131919429998014},{"$f":"INDEX(Calculator!$D$6:$CM$36,MATCH($N26&Q$2,Calculator!$A$6:$A$36,0),MATCH(Q$1&$O26,Calculator!$D$2:$CM$2,0))","v":0.94461290563621803},null,23,"Electricity",{"$f":"INDEX(Calculator!$D$6:$CM$36,MATCH($S26&U$2,Calculator!$A$6:$A$36,0),MATCH(U$1&$T26,Calculator!$D$2:$CM$2,0))","v":0.99083640381687654},{"$f":"INDEX(Calculator!$D$6:$CM$36,MATCH($S26&V$2,Calculator!$A$6:$A$36,0),MATCH(V$1&$T26,Calculator!$D$2:$CM$2,0))","v":0.9842581552238463},null,null,null,null,null,23,"Natural Gas",{"$f":"INDEX(P26:V26,0, MATCH($AB$1,$P$1:$V$1,0))","v":0.94461290563621803},null,"Natural Gas",23,0.94461290563621803]
[null,null,"For v10 : click the \"Generate JSON\" button to generate, save in the computer",null,null,null,null,null,null,null,null,null,null,24,"Natural Gas",{"$f":"INDEX(Calculator!$D$6:$CM$36,MATCH($N27&P$2,Calculator!$A$6:$A$36,0),MATCH(P$1&$O27,Calculator!$D$2:$CM$2,0))","v":5.6448818078190737},{"$f":"INDEX(Calculator!$D$6:$CM$36,MATCH($N27&Q$2,Calculator!$A$6:$A$36,0),MATCH(Q$1&$O27,Calculator!$D$2:$CM$2,0))","v":6.3462810817867572},null,24,"Electricity",{"$f":"INDEX(Calculator!$D$6:$CM$36,MATCH($S27&U$2,Calculator!$A$6:$A$36,0),MATCH(U$1&$T27,Calculator!$D$2:$CM$2,0))","v":0.99547424770603277},{"$f":"INDEX(Calculator!$D$6:$CM$36,MATCH($S27&V$2,Calculator!$A$6:$A$36,0),MATCH(V$1&$T27,Calculator!$D$2:$CM$2,0))","v":0.98835277902239516},null,null,null,null,null,24,"Natural Gas",{"$f":"INDEX(P27:V27,0, MATCH($AB$1,$P$1:$V$1,0))","v":6.3462810817867572},null,"Natural Gas",24,6.3462810817867572]
[null,null,"And upload this file in the \"Upload Economic Parameter Data\" under \"Help\" tab in v10",null,null,null,null,null,null,null,null,null,null,25,"Natural Gas",{"$f":"INDEX(Calculator!$D$6:$CM$36,MATCH($N28&P$2,Calculator!$A$6:$A$36,0),MATCH(P$1&$O28,Calculator!$D$2:$CM$2,0))","v":-4.0570709933969402},{"$f":"INDEX(Calculator!$D$6:$CM$36,MATCH($N28&Q$2,Calculator!$A$6:$A$36,0),MATCH(Q$1&$O28,Calculator!$D$2:$CM$2,0))","v":-4.568570649654121},null,25,"Electricity",{"$f":"INDEX(Calculator!$D$6:$CM$36,MATCH($S28&U$2,Calculator!$A$6:$A$36,0),MATCH(U$1&$T28,Calculator!$D$2:$CM$2,0))","v":1.000108828427382},{"$f":"INDEX(Calculator!$D$6:$CM$36,MATCH($S28&V$2,Calculator!$A$6:$A$36,0),MATCH(V$1&$T28,Calculator!$D$2:$CM$2,0))","v":0.99244452186054921},null,null,null,null,null,25,"Natural Gas",{"$f":"INDEX(P28:V28,0, MATCH($AB$1,$P$1:$V$1,0))","v":-4.568570649654121},null,"Natural Gas",25,-4.568570649654121]
[null,null,null,null,null,null,null,null,null,null,null,null,null,0,"Oil",{"$f":"INDEX(Calculator!$D$6:$CM$36,MATCH($N29&P$2,Calculator!$A$6:$A$36,0),MATCH(P$1&$O29,Calculator!$D$2:$CM$2,0))","v":1},{"$f":"INDEX(Calculator!$D$6:$CM$36,MATCH($N29&Q$2,Calculator!$A$6:$A$36,0),MATCH(Q$1&$O29,Calculator!$D$2:$CM$2,0))","v":1},null,26,"Electricity",{"$f":"INDEX(Calculator!$D$6:$CM$36,MATCH($S29&U$2,Calculator!$A$6:$A$36,0),MATCH(U$1&$T29,Calculator!$D$2:$CM$2,0))","v":1.0030568524386769},{"$f":"INDEX(Calculator!$D$6:$CM$36,MATCH($S29&V$2,Calculator!$A$6:$A$36,0),MATCH(V$1&$T29,Calculator!$D$2:$CM$2,0))","v":0.99504725053444099},null,null,null,null,null,0,"Oil",{"$f":"INDEX(P29:V29,0, MATCH($AB$1,$P$1:$V$1,0))","v":1},null,"Oil",0,1]
[null,"SCC: Social Cost of Carbon",null,null,null,null,null,null,null,null,null,null,null,1,"Oil",{"$f":"INDEX(Calculator!$D$6:$CM$36,MATCH($N30&P$2,Calculator!$A$6:$A$36,0),MATCH(P$1&$O30,Calculator!$D$2:$CM$2,0))","v":0.9596828259813811},{"$f":"INDEX(Calculator!$D$6:$CM$36,MATCH($N30&Q$2,Calculator!$A$6:$A$36,0),MATCH(Q$1&$O30,Calculator!$D$2:$CM$2,0))","v":0.96744096993821582},null,27,"Electricity",{"$f":"INDEX(Calculator!$D$6:$CM$36,MATCH($S30&U$2,Calculator!$A$6:$A$36,0),MATCH(U$1&$T30,Calculator!$D$2:$CM$2,0))","v":1.0051084138858204},{"$f":"INDEX(Calculator!$D$6:$CM$36,MATCH($S30&V$2,Calculator!$A$6:$A$36,0),MATCH(V$1&$T30,Calculator!$D$2:$CM$2,0))","v":0.99685851726234886},null,null,null,null,null,1,"Oil",{"$f":"INDEX(P30:V30,0, MATCH($AB$1,$P$1:$V$1,0))","v":0.96744096993821582},null,"Oil",1,0.96744096993821582]
[null,"WA: Weatherization Assistant application",null,null,"Having Trouble? Contact us at Weatherization Helpdesk <wahelpdesk@ornl.gov>",null,null,null,null,null,null,null,null,2,"Oil",{"$f":"INDEX(Calculator!$D$6:$CM$36,MATCH($N31&P$2,Calculator!$A$6:$A$36,0),MATCH(P$1&$O31,Calculator!$D$2:$CM$2,0))","v":0.91330895166801818},{"$f":"INDEX(Calculator!$D$6:$CM$36,MATCH($N31&Q$2,Calculator!$A$6:$A$36,0),MATCH(Q$1&$O31,Calculator!$D$2:$CM$2,0))","v":0.9296191683567282},null,28,"Electricity",{"$f":"INDEX(Calculator!$D$6:$CM$36,MATCH($S31&U$2,Calculator!$A$6:$A$36,0),MATCH(U$1&$T31,Calculator!$D$2:$CM$2,0))","v":1.0087487478964019},{"$f":"INDEX(Calculator!$D$6:$CM$36,MATCH($S31&V$2,Calculator!$A$6:$A$36,0),MATCH(V$1&$T31,Calculator!$D$2:$CM$2,0))","v":1.0000724672422618},null,null,null,null,null,2,"Oil",{"$f":"INDEX(P31:V31,0, MATCH($AB$1,$P$1:$V$1,0))","v":0.9296191683567282},null,"Oil",2,0.9296191683567282]
[null,null,null,null,null,null,null,null,null,null,null,null,null,3,"Oil",{"$f":"INDEX(Calculator!$D$6:$CM$36,MATCH($N32&P$2,Calculator!$A$6:$A$36,0),MATCH(P$1&$O32,Calculator!$D$2:$CM$2,0))","v":0.88964723820021419},{"$f":"INDEX(Calculator!$D$6:$CM$36,MATCH($N32&Q$2,Calculator!$A$6:$A$36,0),MATCH(Q$1&$O32,Calculator!$D$2:$CM$2,0))","v":0.9115323557019096},null,29,"Electricity",{"$f":"INDEX(Calculator!$D$6:$CM$36,MATCH($S32&U$2,Calculator!$A$6:$A$36,0),MATCH(U$1&$T32,Calculator!$D$2:$CM$2,0))","v":1.0129567920772675},{"$f":"INDEX(Calculator!$D$6:$CM$36,MATCH($S32&V$2,Calculator!$A$6:$A$36,0),MATCH(V$1&$T32,Calculator!$D$2:$CM$2,0))","v":1.0037876327933499},null,null,null,null,null,3,"Oil",{"$f":"INDEX(P32:V32,0, MATCH($AB$1,$P$1:$V$1,0))","v":0.9115323557019096},null,"Oil",3,0.9115323557019096]
[null,null,null,null,null,null,null,null,null,null,null,null,null,4,"Oil",{"$f":"INDEX(Calculator!$D$6:$CM$36,MATCH($N33&P$2,Calculator!$A$6:$A$36,0),MATCH(P$1&$O33,Calculator!$D$2:$CM$2,0))","v":0.87526585386183964},{"$f":"INDEX(Calculator!$D$6:$CM$36,MATCH($N33&Q$2,Calculator!$A$6:$A$36,0),MATCH(Q$1&$O33,Calculator!$D$2:$CM$2,0))","v":0.90150938135162406},null,30,"Electricity",{"$f":"INDEX(Calculator!$D$6:$CM$36,MATCH($S33&U$2,Calculator!$A$6:$A$36,0),MATCH(U$1&$T33,Calculator!$D$2:$CM$2,0))","v":1.017182390317918},{"$f":"INDEX(Calculator!$D$6:$CM$36,MATCH($S33&V$2,Calculator!$A$6:$A$36,0),MATCH(V$1&$T33,Calculator!$D$2:$CM$2,0))","v":1.0075182963371849},null,null,null,null,null,4,"Oil",{"$f":"INDEX(P33:V33,0, MATCH($AB$1,$P$1:$V$1,0))","v":0.90150938135162406},null,"Oil",4,0.90150938135162406]
[null,null,null,null,null,null,null,null,null,null,null,null,null,5,"Oil",{"$f":"INDEX(Calculator!$D$6:$CM$36,MATCH($N34&P$2,Calculator!$A$6:$A$36,0),MATCH(P$1&$O34,Calculator!$D$2:$CM$2,0))","v":0.86232679786134725},{"$f":"INDEX(Calculator!$D$6:$CM$36,MATCH($N34&Q$2,Calculator!$A$6:$A$36,0),MATCH(Q$1&$O34,Calculator!$D$2:$CM$2,0))","v":0.89521292996080726},null,0,"Natural Gas",{"$f":"INDEX(Calculator!$D$6:$CM$36,MATCH($S34&U$2,Calculator!$A$6:$A$36,0),MATCH(U$1&$T34,Calculator!$D$2:$CM$2,0))","v":1},{"$f":"INDEX(Calculator!$D$6:$CM$36,MATCH($S34&V$2,Calculator!$A$6:$A$36,0),MATCH(V$1&$T34,Calculator!$D$2:$CM$2,0))","v":1},null,null,null,null,null,5,"Oil",{"$f":"INDEX(P34:V34,0, MATCH($AB$1,$P$1:$V$1,0))","v":0.89521292996080726},null,"Oil",5,0.89521292996080726]
[null,null,{"$f":"$E$3","v":"FPI_SCC for v8.9 (adjusted for 30 year UPV)"},null,null,null,null,null,null,null,null,null,null,6,"Oil",{"$f":"INDEX(Calculator!$D$6:$CM$36,MATCH($N35&P$2,Calculator!$A$6:$A$36,0),MATCH(P$1&$O35,Calculator!$D$2:$CM$2,0))","v":0.86097861362888795},{"$f":"INDEX(Calculator!$D$6:$CM$36,MATCH($N35&Q$2,Calculator!$A$6:$A$36,0),MATCH(Q$1&$O35,Calculator!$D$2:$CM$2,0))","v":0.89651472833991153},null,1,"Natural Gas",{"$f":"INDEX(Calculator!$D$6:$CM$36,MATCH($S35&U$2,Calculator!$A$6:$A$36,0),MATCH(U$1&$T35,Calculator!$D$2:$CM$2,0))","v":0.98031290628534118},{"$f":"INDEX(Calculator!$D$6:$CM$36,MATCH($S35&V$2,Calculator!$A$6:$A$36,0),MATCH(V$1&$T35,Calculator!$D$2:$CM$2,0))","v":0.98644692290046421},null,null,null,null,null,6,"Oil",{"$f":"INDEX(P35:V35,0, MATCH($AB$1,$P$1:$V$1,0))","v":0.89651472833991153},null,"Oil",6,0.89651472833991153]
[null,null,{"$f":" IF( OR( E3 = \"FPI for v8.9 (adjusted for 30 yr UPV)\", E3 = \"FPI for v10\"), 0, 1)","v":1},null,null,"FPI for v8.9 (adjusted for 30 yr UPV)",null,null,null,null,null,null,null,7,"Oil",{"$f":"INDEX(Calculator!$D$6:$CM$36,MATCH($N36&P$2,Calculator!$A$6:$A$36,0),MATCH(P$1&$O36,Calculator!$D$2:$CM$2,0))","v":0.86205559858561076},{"$f":"INDEX(Calculator!$D$6:$CM$36,MATCH($N36&Q$2,Calculator!$A$6:$A$36,0),MATCH(Q$1&$O36,Calculator!$D$2:$CM$2,0))","v":0.8999237981239363},null,2,"Natural Gas",{"$f":"INDEX(Calculator!$D$6:$CM$36,MATCH($S36&U$2,Calculator!$A$6:$A$36,0),MATCH(U$1&$T36,Calculator!$D$2:$CM$2,0))","v":0.91127274490115895},{"$f":"INDEX(Calculator!$D$6:$CM$36,MATCH($S36&V$2,Calculator!$A$6:$A$36,0),MATCH(V$1&$T36,Calculator!$D$2:$CM$2,0))","v":0.93139274010388873},null,null,null,null,null,7,"Oil",{"$f":"INDEX(P36:V36,0, MATCH($AB$1,$P$1:$V$1,0))","v":0.8999237981239363},null,"Oil",7,0.8999237981239363]
[null,null,{"$f":"C36","v":1},null,null,"FPI_SCC for v8.9 (adjusted for 30 year UPV)",null,null,null,null,null,null,null,8,"Oil",{"$f":"INDEX(Calculator!$D$6:$CM$36,MATCH($N37&P$2,Calculator!$A$6:$A$36,0),MATCH(P$1&$O37,Calculator!$D$2:$CM$2,0))","v":0.86547726425671789},{"$f":"INDEX(Calculator!$D$6:$CM$36,MATCH($N37&Q$2,Calculator!$A$6:$A$36,0),MATCH(Q$1&$O37,Calculator!$D$2:$CM$2,0))","v":0.90537020148663738},null,3,"Natural Gas",{"$f":"INDEX(Calculator!$D$6:$CM$36,MATCH($S37&U$2,Calculator!$A$6:$A$36,0),MATCH(U$1&$T37,Calculator!$D$2:$CM$2,0))","v":0.83484140401895668},{"$f":"INDEX(Calculator!$D$6:$CM$36,MATCH($S37&V$2,Calculator!$A$6:$A$36,0),MATCH(V$1&$T37,Calculator!$D$2:$CM$2,0))","v":0.87012329782988573},null,null,null,null,null,8,"Oil",{"$f":"INDEX(P37:V37,0, MATCH($AB$1,$P$1:$V$1,0))","v":0.90537020148663738},null,"Oil",8,0.90537020148663738]
[null,null,null,null,null,"FPI for v10",null,null,null,null,null,null,null,9,"Oil",{"$f":"INDEX(Calculator!$D$6:$CM$36,MATCH($N38&P$2,Calculator!$A$6:$A$36,0),MATCH(P$1&$O38,Calculator!$D$2:$CM$2,0))","v":0.86933002324909658},{"$f":"INDEX(Calculator!$D$6:$CM$36,MATCH($N38&Q$2,Calculator!$A$6:$A$36,0),MATCH(Q$1&$O38,Calculator!$D$2:$CM$2,0))","v":0.91119118928362042},null,4,"Natural Gas",{"$f":"INDEX(Calculator!$D$6:$CM$36,MATCH($S38&U$2,Calculator!$A$6:$A$36,0),MATCH(U$1&$T38,Calculator!$D$2:$CM$2,0))","v":0.77109079382382839},{"$f":"INDEX(Calculator!$D$6:$CM$36,MATCH($S38&V$2,Calculator!$A$6:$A$36,0),MATCH(V$1&$T38,Calculator!$D$2:$CM$2,0))","v":0.81951711053496357},null,null,null,null,null,9,"Oil",{"$f":"INDEX(P38:V38,0, MATCH($AB$1,$P$1:$V$1,0))","v":0.91119118928362042},null,"Oil",9,0.91119118928362042]
[null,null,null,null,null,"FPI_SCC for v10",null,null,null,null,null,null,null,10,"Oil",{"$f":"INDEX(Calculator!$D$6:$CM$36,MATCH($N39&P$2,Calculator!$A$6:$A$36,0),MATCH(P$1&$O39,Calculator!$D$2:$CM$2,0))","v":0.87135834742203488},{"$f":"INDEX(Calculator!$D$6:$CM$36,MATCH($N39&Q$2,Calculator!$A$6:$A$36,0),MATCH(Q$1&$O39,Calculator!$D$2:$CM$2,0))","v":0.91542689414764422},null,5,"Natural Gas",{"$f":"INDEX(Calculator!$D$6:$CM$36,MATCH($S39&U$2,Calculator!$A$6:$A$36,0),MATCH(U$1&$T39,Calculator!$D$2:$CM$2,0))","v":0.71793289757727208},{"$f":"INDEX(Calculator!$D$6:$CM$36,MATCH($S39&V$2,Calculator!$A$6:$A$36,0),MATCH(V$1&$T39,Calculator!$D$2:$CM$2,0))","v":0.7808202045643523},null,null,null,null,null,10,"Oil",{"$f":"INDEX(P39:V39,0, MATCH($AB$1,$P$1:$V$1,0))","v":0.91542689414764422},null,"Oil",10,0.91542689414764422]
[null,null,null,null,null,null,null,null,null,null,null,null,null,11,"Oil",{"$f":"INDEX(Calculator!$D$6:$CM$36,MATCH($N40&P$2,Calculator!$A$6:$A$36,0),MATCH(P$1&$O40,Calculator!$D$2:$CM$2,0))","v":0.87396763122519694},{"$f":"INDEX(Calculator!$D$6:$CM$36,MATCH($N40&Q$2,Calculator!$A$6:$A$36,0),MATCH(Q$1&$O40,Calculator!$D$2:$CM$2,0))","v":0.92016740487084081},null,6,"Natural Gas",{"$f":"INDEX(Calculator!$D$6:$CM$36,MATCH($S40&U$2,Calculator!$A$6:$A$36,0),MATCH(U$1&$T40,Calculator!$D$2:$CM$2,0))","v":0.70464145203382345},{"$f":"INDEX(Calculator!$D$6:$CM$36,MATCH($S40&V$2,Calculator!$A$6:$A$36,0),MATCH(V$1&$T40,Calculator!$D$2:$CM$2,0))","v":0.77264524240858889},null,null,null,null,null,11,"Oil",{"$f":"INDEX(P40:V40,0, MATCH($AB$1,$P$1:$V$1,0))","v":0.92016740487084081},null,"Oil",11,0.92016740487084081]
[null,null,null,null,null,null,null,null,null,null,null,null,null,12,"Oil",{"$f":"INDEX(Calculator!$D$6:$CM$36,MATCH($N41&P$2,Calculator!$A$6:$A$36,0),MATCH(P$1&$O41,Calculator!$D$2:$CM$2,0))","v":0.87693841076462198},{"$f":"INDEX(Calculator!$D$6:$CM$36,MATCH($N41&Q$2,Calculator!$A$6:$A$36,0),MATCH(Q$1&$O41,Calculator!$D$2:$CM$2,0))","v":0.92522202548435994},null,7,"Natural Gas",{"$f":"INDEX(Calculator!$D$6:$CM$36,MATCH($S41&U$2,Calculator!$A$6:$A$36,0),MATCH(U$1&$T41,Calculator!$D$2:$CM$2,0))","v":0.70591713964079483},{"$f":"INDEX(Calculator!$D$6:$CM$36,MATCH($S41&V$2,Calculator!$A$6:$A$36,0),MATCH(V$1&$T41,Calculator!$D$2:$CM$2,0))","v":0.77671981530962486},null,null,null,null,null,12,"Oil",{"$f":"INDEX(P41:V41,0, MATCH($AB$1,$P$1:$V$1,0))","v":0.92522202548435994},null,"Oil",12,0.92522202548435994]
[null,null,null,null,null,null,null,null,null,null,null,null,null,13,"Oil",{"$f":"INDEX(Calculator!$D$6:$CM$36,MATCH($N42&P$2,Calculator!$A$6:$A$36,0),MATCH(P$1&$O42,Calculator!$D$2:$CM$2,0))","v":0.87942932981491606},{"$f":"INDEX(Calculator!$D$6:$CM$36,MATCH($N42&Q$2,Calculator!$A$6:$A$36,0),MATCH(Q$1&$O42,Calculator!$D$2:$CM$2,0))","v":0.92985968702895816},null,8,"Natural Gas",{"$f":"INDEX(Calculator!$D$6:$CM$36,MATCH($S42&U$2,Calculator!$A$6:$A$36,0),MATCH(U$1&$T42,Calculator!$D$2:$CM$2,0))","v":0.71119303080644869},{"$f":"INDEX(Calculator!$D$6:$CM$36,MATCH($S42&V$2,Calculator!$A$6:$A$36,0),MATCH(V$1&$T42,Calculator!$D$2:$CM$2,0))","v":0.78415816838761399},null,null,null,null,null,13,"Oil",{"$f":"INDEX(P42:V42,0, MATCH($AB$1,$P$1:$V$1,0))","v":0.92985968702895816},null,"Oil",13,0.92985968702895816]
[null,null,null,null,null,null,null,null,null,null,null,null,null,14,"Oil",{"$f":"INDEX(Calculator!$D$6:$CM$36,MATCH($N43&P$2,Calculator!$A$6:$A$36,0),MATCH(P$1&$O43,Calculator!$D$2:$CM$2,0))","v":0.88183042675171408},{"$f":"INDEX(Calculator!$D$6:$CM$36,MATCH($N43&Q$2,Calculator!$A$6:$A$36,0),MATCH(Q$1&$O43,Calculator!$D$2:$CM$2,0))","v":0.93689255953688566},null,9,"Natural Gas",{"$f":"INDEX(Calculator!$D$6:$CM$36,MATCH($S43&U$2,Calculator!$A$6:$A$36,0),MATCH(U$1&$T43,Calculator!$D$2:$CM$2,0))","v":0.71696837151239889},{"$f":"INDEX(Calculator!$D$6:$CM$36,MATCH($S43&V$2,Calculator!$A$6:$A$36,0),MATCH(V$1&$T43,Calculator!$D$2:$CM$2,0))","v":0.79201650970829895},null,null,null,null,null,14,{"$f":"IF(OR($AB$1=\"FPI for v10\", $AB$1=\"FPI_SCC for v10\"), $T43, $O43)","v":"Oil"},{"$f":"INDEX(P43:V43,0, MATCH($AB$1,$P$1:$V$1,0))","v":0.93689255953688566},null,"Oil",14,0.93689255953688566]
[null,null,null,null,null,null,null,null,null,null,null,null,null,15,"Oil",{"$f":"INDEX(Calculator!$D$6:$CM$36,MATCH($N44&P$2,Calculator!$A$6:$A$36,0),MATCH(P$1&$O44,Calculator!$D$2:$CM$2,0))","v":0.88458739626402361},{"$f":"INDEX(Calculator!$D$6:$CM$36,MATCH($N43&Q$2,Calculator!$A$6:$A$36,0),MATCH(Q$1&$O43,Calculator!$D$2:$CM$2,0))","v":0.93689255953688566},null,10,"Natural Gas",{"$f":"INDEX(Calculator!$D$6:$CM$36,MATCH($S44&U$2,Calculator!$A$6:$A$36,0),MATCH(U$1&$T44,Calculator!$D$2:$CM$2,0))","v":0.72576281843064205},{"$f":"INDEX(Calculator!$D$6:$CM$36,MATCH($S44&V$2,Calculator!$A$6:$A$36,0),MATCH(V$1&$T44,Calculator!$D$2:$CM$2,0))","v":0.80241362423890805},null,null,null,null,null,{"$f":"IF(OR($AB$1=\"FPI for v10\", $AB$1=\"FPI_SCC for v10\"), $S44, $N44)","v":15},"Oil",{"$f":"INDEX(P44:V44,0, MATCH($AB$1,$P$1:$V$1,0))","v":0.93689255953688566},null,"Oil",15,0.93689255953688566]
[null,null,null,null,null,null,null,null,null,null,null,null,null,16,"Oil",{"$f":"INDEX(Calculator!$D$6:$CM$36,MATCH($N45&P$2,Calculator!$A$6:$A$36,0),MATCH(P$1&$O45,Calculator!$D$2:$CM$2,0))","v":0.88667469890902706},{"$f":"INDEX(Calculator!$D$6:$CM$36,MATCH($N45&Q$2,Calculator!$A$6:$A$36,0),MATCH(Q$1&$O45,Calculator!$D$2:$CM$2,0))","v":0.94604834920142544},null,11,"Natural Gas",{"$f":"INDEX(Calculator!$D$6:$CM$36,MATCH($S45&U$2,Calculator!$A$6:$A$36,0),MATCH(U$1&$T45,Calculator!$D$2:$CM$2,0))","v":0.73548382624922659},{"$f":"INDEX(Calculator!$D$6:$CM$36,MATCH($S45&V$2,Calculator!$A$6:$A$36,0),MATCH(V$1&$T45,Calculator!$D$2:$CM$2,0))","v":0.81358988591630232},null,null,null,null,null,16,"Oil",{"$f":"INDEX(P45:V45,0, MATCH($AB$1,$P$1:$V$1,0))","v":0.94604834920142544},null,"Oil",16,0.94604834920142544]
[null,null,null,null,null,null,null,null,null,null,null,null,null,17,"Oil",{"$f":"INDEX(Calculator!$D$6:$CM$36,MATCH($N46&P$2,Calculator!$A$6:$A$36,0),MATCH(P$1&$O46,Calculator!$D$2:$CM$2,0))","v":0.8889455339191682},{"$f":"INDEX(Calculator!$D$6:$CM$36,MATCH($N46&Q$2,Calculator!$A$6:$A$36,0),MATCH(Q$1&$O46,Calculator!$D$2:$CM$2,0))","v":0.95049477592143383},null,12,"Natural Gas",{"$f":"INDEX(Calculator!$D$6:$CM$36,MATCH($S46&U$2,Calculator!$A$6:$A$36,0),MATCH(U$1&$T46,Calculator!$D$2:$CM$2,0))","v":0.74432053488527972},{"$f":"INDEX(Calculator!$D$6:$CM$36,MATCH($S46&V$2,Calculator!$A$6:$A$36,0),MATCH(V$1&$T46,Calculator!$D$2:$CM$2,0))","v":0.82402253842054884},null,null,null,null,null,17,"Oil",{"$f":"INDEX(P46:V46,0, MATCH($AB$1,$P$1:$V$1,0))","v":0.95049477592143383},null,"Oil",17,0.95049477592143383]
[null,null,null,null,null,null,null,null,null,null,null,null,null,18,"Oil",{"$f":"INDEX(Calculator!$D$6:$CM$36,MATCH($N47&P$2,Calculator!$A$6:$A$36,0),MATCH(P$1&$O47,Calculator!$D$2:$CM$2,0))","v":0.89329553387332161},{"$f":"INDEX(Calculator!$D$6:$CM$36,MATCH($N47&Q$2,Calculator!$A$6:$A$36,0),MATCH(Q$1&$O47,Calculator!$D$2:$CM$2,0))","v":0.95674782498027733},null,13,"Natural Gas",{"$f":"INDEX(Calculator!$D$6:$CM$36,MATCH($S47&U$2,Calculator!$A$6:$A$36,0),MATCH(U$1&$T47,Calculator!$D$2:$CM$2,0))","v":0.74851464443343485},{"$f":"INDEX(Calculator!$D$6:$CM$36,MATCH($S47&V$2,Calculator!$A$6:$A$36,0),MATCH(V$1&$T47,Calculator!$D$2:$CM$2,0))","v":0.83055121890129313},null,null,null,null,null,18,"Oil",{"$f":"INDEX(P47:V47,0, MATCH($AB$1,$P$1:$V$1,0))","v":0.95674782498027733},null,"Oil",18,0.95674782498027733]
[null,null,null,null,null,null,null,null,null,null,null,null,null,19,"Oil",{"$f":"INDEX(Calculator!$D$6:$CM$36,MATCH($N48&P$2,Calculator!$A$6:$A$36,0),MATCH(P$1&$O48,Calculator!$D$2:$CM$2,0))","v":0.89486521688636955},{"$f":"INDEX(Calculator!$D$6:$CM$36,MATCH($N48&Q$2,Calculator!$A$6:$A$36,0),MATCH(Q$1&$O48,Calculator!$D$2:$CM$2,0))","v":0.9605850086171358},null,14,"Natural Gas",{"$f":"INDEX(Calculator!$D$6:$CM$36,MATCH($S48&U$2,Calculator!$A$6:$A$36,0),MATCH(U$1&$T48,Calculator!$D$2:$CM$2,0))","v":0.75258583376316301},{"$f":"INDEX(Calculator!$D$6:$CM$36,MATCH($S48&V$2,Calculator!$A$6:$A$36,0),MATCH(V$1&$T48,Calculator!$D$2:$CM$2,0))","v":0.83997837981443046},null,null,null,null,null,19,"Oil",{"$f":"INDEX(P48:V48,0, MATCH($AB$1,$P$1:$V$1,0))","v":0.9605850086171358},null,"Oil",19,0.9605850086171358]
[null,null,null,null,null,null,null,null,null,null,null,null,null,20,"Oil",{"$f":"INDEX(Calculator!$D$6:$CM$36,MATCH($N49&P$2,Calculator!$A$6:$A$36,0),MATCH(P$1&$O49,Calculator!$D$2:$CM$2,0))","v":0.89775335639638043},{"$f":"INDEX(Calculator!$D$6:$CM$36,MATCH($N49&Q$2,Calculator!$A$6:$A$36,0),MATCH(Q$1&$O49,Calculator!$D$2:$CM$2,0))","v":0.96556782188143453},null,15,"Natural Gas",{"$f":"INDEX(Calculator!$D$6:$CM$36,MATCH($S49&U$2,Calculator!$A$6:$A$36,0),MATCH(U$1&$T49,Calculator!$D$2:$CM$2,0))","v":0.76050682310848683},{"$f":"INDEX(Calculator!$D$6:$CM$36,MATCH($S49&V$2,Calculator!$A$6:$A$36,0),MATCH(V$1&$T49,Calculator!$D$2:$CM$2,0))","v":0.84964100190581904},null,null,null,null,null,20,"Oil",{"$f":"INDEX(P49:V49,0, MATCH($AB$1,$P$1:$V$1,0))","v":0.96556782188143453},null,"Oil",20,0.96556782188143453]
[null,null,null,null,null,null,null,null,null,null,null,null,null,21,"Oil",{"$f":"INDEX(Calculator!$D$6:$CM$36,MATCH($N50&P$2,Calculator!$A$6:$A$36,0),MATCH(P$1&$O50,Calculator!$D$2:$CM$2,0))","v":0.89710097763432051},{"$f":"INDEX(Calculator!$D$6:$CM$36,MATCH($N50&Q$2,Calculator!$A$6:$A$36,0),MATCH(Q$1&$O50,Calculator!$D$2:$CM$2,0))","v":0.96994747660376335},null,16,"Natural Gas",{"$f":"INDEX(Calculator!$D$6:$CM$36,MATCH($S50&U$2,Calculator!$A$6:$A$36,0),MATCH(U$1&$T50,Calculator!$D$2:$CM$2,0))","v":0.76114530931431823},{"$f":"INDEX(Calculator!$D$6:$CM$36,MATCH($S50&V$2,Calculator!$A$6:$A$36,0),MATCH(V$1&$T50,Calculator!$D$2:$CM$2,0))","v":0.85317975071429641},null,null,null,null,null,21,"Oil",{"$f":"INDEX(P50:V50,0, MATCH($AB$1,$P$1:$V$1,0))","v":0.96994747660376335},null,"Oil",21,0.96994747660376335]
[null,null,null,null,null,null,null,null,null,null,null,null,null,22,"Oil",{"$f":"INDEX(Calculator!$D$6:$CM$36,MATCH($N51&P$2,Calculator!$A$6:$A$36,0),MATCH(P$1&$O51,Calculator!$D$2:$CM$2,0))","v":0.8988804625100687},{"$f":"INDEX(Calculator!$D$6:$CM$36,MATCH($N51&Q$2,Calculator!$A$6:$A$36,0),MATCH(Q$1&$O51,Calculator!$D$2:$CM$2,0))","v":0.97396696070359146},null,17,"Natural Gas",{"$f":"INDEX(Calculator!$D$6:$CM$36,MATCH($S51&U$2,Calculator!$A$6:$A$36,0),MATCH(U$1&$T51,Calculator!$D$2:$CM$2,0))","v":0.76500983620007323},{"$f":"INDEX(Calculator!$D$6:$CM$36,MATCH($S51&V$2,Calculator!$A$6:$A$36,0),MATCH(V$1&$T51,Calculator!$D$2:$CM$2,0))","v":0.85943128439233796},null,null,null,null,null,22,"Oil",{"$f":"INDEX(P51:V51,0, MATCH($AB$1,$P$1:$V$1,0))","v":0.97396696070359146},null,"Oil",22,0.97396696070359146]
[null,null,null,null,null,null,null,null,null,null,null,null,null,23,"Oil",{"$f":"INDEX(Calculator!$D$6:$CM$36,MATCH($N52&P$2,Calculator!$A$6:$A$36,0),MATCH(P$1&$O52,Calculator!$D$2:$CM$2,0))","v":0.90764854615200052},{"$f":"INDEX(Calculator!$D$6:$CM$36,MATCH($N52&Q$2,Calculator!$A$6:$A$36,0),MATCH(Q$1&$O52,Calculator!$D$2:$CM$2,0))","v":0.98405895900413387},null,18,"Natural Gas",{"$f":"INDEX(Calculator!$D$6:$CM$36,MATCH($S52&U$2,Calculator!$A$6:$A$36,0),MATCH(U$1&$T52,Calculator!$D$2:$CM$2,0))","v":0.77077090741299525},{"$f":"INDEX(Calculator!$D$6:$CM$36,MATCH($S52&V$2,Calculator!$A$6:$A$36,0),MATCH(V$1&$T52,Calculator!$D$2:$CM$2,0))","v":0.8672776264642148},null,null,null,null,null,23,"Oil",{"$f":"INDEX(P52:V52,0, MATCH($AB$1,$P$1:$V$1,0))","v":0.98405895900413387},null,"Oil",23,0.98405895900413387]
[null,null,null,null,null,null,null,null,null,null,null,null,null,24,"Oil",{"$f":"INDEX(Calculator!$D$6:$CM$36,MATCH($N53&P$2,Calculator!$A$6:$A$36,0),MATCH(P$1&$O53,Calculator!$D$2:$CM$2,0))","v":5.8743275285842982},{"$f":"INDEX(Calculator!$D$6:$CM$36,MATCH($N53&Q$2,Calculator!$A$6:$A$36,0),MATCH(Q$1&$O53,Calculator!$D$2:$CM$2,0))","v":6.4221432294747105},null,19,"Natural Gas",{"$f":"INDEX(Calculator!$D$6:$CM$36,MATCH($S53&U$2,Calculator!$A$6:$A$36,0),MATCH(U$1&$T53,Calculator!$D$2:$CM$2,0))","v":0.77365585155398331},{"$f":"INDEX(Calculator!$D$6:$CM$36,MATCH($S53&V$2,Calculator!$A$6:$A$36,0),MATCH(V$1&$T53,Calculator!$D$2:$CM$2,0))","v":0.87270542680714147},null,null,null,null,null,24,"Oil",{"$f":"INDEX(P53:V53,0, MATCH($AB$1,$P$1:$V$1,0))","v":6.4221432294747105},null,"Oil",24,6.4221432294747105]
[null,null,null,null,null,null,null,null,null,null,null,null,null,25,"Oil",{"$f":"INDEX(Calculator!$D$6:$CM$36,MATCH($N54&P$2,Calculator!$A$6:$A$36,0),MATCH(P$1&$O54,Calculator!$D$2:$CM$2,0))","v":-4.2004557372657754},{"$f":"INDEX(Calculator!$D$6:$CM$36,MATCH($N54&Q$2,Calculator!$A$6:$A$36,0),MATCH(Q$1&$O54,Calculator!$D$2:$CM$2,0))","v":-4.6030917570904002},null,20,"Natural Gas",{"$f":"INDEX(Calculator!$D$6:$CM$36,MATCH($S54&U$2,Calculator!$A$6:$A$36,0),MATCH(U$1&$T54,Calculator!$D$2:$CM$2,0))","v":0.77337994819727018},{"$f":"INDEX(Calculator!$D$6:$CM$36,MATCH($S54&V$2,Calculator!$A$6:$A$36,0),MATCH(V$1&$T54,Calculator!$D$2:$CM$2,0))","v":0.87547526337418469},null,null,null,null,null,25,"Oil",{"$f":"INDEX(P54:V54,0, MATCH($AB$1,$P$1:$V$1,0))","v":-4.6030917570904002},null,"Oil",25,-4.6030917570904002]
[null,null,null,null,null,null,null,null,null,null,null,null,null,0,"Electricity",{"$f":"INDEX(Calculator!$D$6:$CM$36,MATCH($N55&P$2,Calculator!$A$6:$A$36,0),MATCH(P$1&$O55,Calculator!$D$2:$CM$2,0))","v":1},{"$f":"INDEX(Calculator!$D$6:$CM$36,MATCH($N55&Q$2,Calculator!$A$6:$A$36,0),MATCH(Q$1&$O55,Calculator!$D$2:$CM$2,0))","v":1},null,21,"Natural Gas",{"$f":"INDEX(Calculator!$D$6:$CM$36,MATCH($S55&U$2,Calculator!$A$6:$A$36,0),MATCH(U$1&$T55,Calculator!$D$2:$CM$2,0))","v":0.7704535908826603},{"$f":"INDEX(Calculator!$D$6:$CM$36,MATCH($S55&V$2,Calculator!$A$6:$A$36,0),MATCH(V$1&$T55,Calculator!$D$2:$CM$2,0))","v":0.87901817156262307},null,null,null,null,null,0,"Electricity",{"$f":"INDEX(P55:V55,0, MATCH($AB$1,$P$1:$V$1,0))","v":1},null,"Electricity",0,1]
[null,null,null,null,null,null,null,null,null,null,null,null,null,1,"Electricity",{"$f":"INDEX(Calculator!$D$6:$CM$36,MATCH($N56&P$2,Calculator!$A$6:$A$36,0),MATCH(P$1&$O56,Calculator!$D$2:$CM$2,0))","v":0.9348597229818798},{"$f":"INDEX(Calculator!$D$6:$CM$36,MATCH($N56&Q$2,Calculator!$A$6:$A$36,0),MATCH(Q$1&$O56,Calculator!$D$2:$CM$2,0))","v":0.94013512917764552},null,22,"Natural Gas",{"$f":"INDEX(Calculator!$D$6:$CM$36,MATCH($S56&U$2,Calculator!$A$6:$A$36,0),MATCH(U$1&$T56,Calculator!$D$2:$CM$2,0))","v":0.77406313870857735},{"$f":"INDEX(Calculator!$D$6:$CM$36,MATCH($S56&V$2,Calculator!$A$6:$A$36,0),MATCH(V$1&$T56,Calculator!$D$2:$CM$2,0))","v":0.88505529277528905},null,null,null,null,null,1,"Electricity",{"$f":"INDEX(P56:V56,0, MATCH($AB$1,$P$1:$V$1,0))","v":0.94013512917764552},null,"Electricity",1,0.94013512917764552]
[null,null,null,null,null,null,null,null,null,null,null,null,null,2,"Electricity",{"$f":"INDEX(Calculator!$D$6:$CM$36,MATCH($N57&P$2,Calculator!$A$6:$A$36,0),MATCH(P$1&$O57,Calculator!$D$2:$CM$2,0))","v":0.86722030620246682},{"$f":"INDEX(Calculator!$D$6:$CM$36,MATCH($N57&Q$2,Calculator!$A$6:$A$36,0),MATCH(Q$1&$O57,Calculator!$D$2:$CM$2,0))","v":0.87158944043772812},null,23,"Natural Gas",{"$f":"INDEX(Calculator!$D$6:$CM$36,MATCH($S57&U$2,Calculator!$A$6:$A$36,0),MATCH(U$1&$T57,Calculator!$D$2:$CM$2,0))","v":0.84131919429998014},{"$f":"INDEX(Calculator!$D$6:$CM$36,MATCH($S57&V$2,Calculator!$A$6:$A$36,0),MATCH(V$1&$T57,Calculator!$D$2:$CM$2,0))","v":0.94461290563621803},null,null,null,null,null,2,"Electricity",{"$f":"INDEX(P57:V57,0, MATCH($AB$1,$P$1:$V$1,0))","v":0.87158944043772812},null,"Electricity",2,0.87158944043772812]
[null,null,null,null,null,null,null,null,null,null,null,null,null,3,"Electricity",{"$f":"INDEX(Calculator!$D$6:$CM$36,MATCH($N58&P$2,Calculator!$A$6:$A$36,0),MATCH(P$1&$O58,Calculator!$D$2:$CM$2,0))","v":0.84483048522146464},{"$f":"INDEX(Calculator!$D$6:$CM$36,MATCH($N58&Q$2,Calculator!$A$6:$A$36,0),MATCH(Q$1&$O58,Calculator!$D$2:$CM$2,0))","v":0.84946776211430075},null,24,"Natural Gas",{"$f":"INDEX(Calculator!$D$6:$CM$36,MATCH($S58&U$2,Calculator!$A$6:$A$36,0),MATCH(U$1&$T58,Calculator!$D$2:$CM$2,0))","v":0.8660605619031958},{"$f":"INDEX(Calculator!$D$6:$CM$36,MATCH($S58&V$2,Calculator!$A$6:$A$36,0),MATCH(V$1&$T58,Calculator!$D$2:$CM$2,0))","v":0.96841982166733309},null,null,null,null,null,3,"Electricity",{"$f":"INDEX(P58:V58,0, MATCH($AB$1,$P$1:$V$1,0))","v":0.84946776211430075},null,"Electricity",3,0.84946776211430075]
[null,null,null,null,null,null,null,null,null,null,null,null,null,4,"Electricity",{"$f":"INDEX(Calculator!$D$6:$CM$36,MATCH($N59&P$2,Calculator!$A$6:$A$36,0),MATCH(P$1&$O59,Calculator!$D$2:$CM$2,0))","v":0.83991193264594588},{"$f":"INDEX(Calculator!$D$6:$CM$36,MATCH($N59&Q$2,Calculator!$A$6:$A$36,0),MATCH(Q$1&$O59,Calculator!$D$2:$CM$2,0))","v":0.84512530839842193},null,25,"Natural Gas",{"$f":"INDEX(Calculator!$D$6:$CM$36,MATCH($S59&U$2,Calculator!$A$6:$A$36,0),MATCH(U$1&$T59,Calculator!$D$2:$CM$2,0))","v":0.86511488989641494},{"$f":"INDEX(Calculator!$D$6:$CM$36,MATCH($S59&V$2,Calculator!$A$6:$A$36,0),MATCH(V$1&$T59,Calculator!$D$2:$CM$2,0))","v":0.97062644826888522},null,null,null,null,null,4,"Electricity",{"$f":"INDEX(P59:V59,0, MATCH($AB$1,$P$1:$V$1,0))","v":0.84512530839842193},null,"Electricity",4,0.84512530839842193]
[null,null,null,null,null,null,null,null,null,null,null,null,null,5,"Electricity",{"$f":"INDEX(Calculator!$D$6:$CM$36,MATCH($N60&P$2,Calculator!$A$6:$A$36,0),MATCH(P$1&$O60,Calculator!$D$2:$CM$2,0))","v":0.83783409529617092},{"$f":"INDEX(Calculator!$D$6:$CM$36,MATCH($N60&Q$2,Calculator!$A$6:$A$36,0),MATCH(Q$1&$O60,Calculator!$D$2:$CM$2,0))","v":0.84564516947866752},null,26,"Natural Gas",{"$f":"INDEX(Calculator!$D$6:$CM$36,MATCH($S60&U$2,Calculator!$A$6:$A$36,0),MATCH(U$1&$T60,Calculator!$D$2:$CM$2,0))","v":0.86482196439390613},{"$f":"INDEX(Calculator!$D$6:$CM$36,MATCH($S60&V$2,Calculator!$A$6:$A$36,0),MATCH(V$1&$T60,Calculator!$D$2:$CM$2,0))","v":0.97338197087521194},null,null,null,null,null,5,"Electricity",{"$f":"INDEX(P60:V60,0, MATCH($AB$1,$P$1:$V$1,0))","v":0.84564516947866752},null,"Electricity",5,0.84564516947866752]
[null,null,null,null,null,null,null,null,null,null,null,null,null,6,"Electricity",{"$f":"INDEX(Calculator!$D$6:$CM$36,MATCH($N61&P$2,Calculator!$A$6:$A$36,0),MATCH(P$1&$O61,Calculator!$D$2:$CM$2,0))","v":0.83833743588948628},{"$f":"INDEX(Calculator!$D$6:$CM$36,MATCH($N61&Q$2,Calculator!$A$6:$A$36,0),MATCH(Q$1&$O61,Calculator!$D$2:$CM$2,0))","v":0.84726671797188313},null,27,"Natural Gas",{"$f":"INDEX(Calculator!$D$6:$CM$36,MATCH($S61&U$2,Calculator!$A$6:$A$36,0),MATCH(U$1&$T61,Calculator!$D$2:$CM$2,0))","v":0.86542230403108378},{"$f":"INDEX(Calculator!$D$6:$CM$36,MATCH($S61&V$2,Calculator!$A$6:$A$36,0),MATCH(V$1&$T61,Calculator!$D$2:$CM$2,0))","v":0.97989048646900223},null,null,null,null,null,6,"Electricity",{"$f":"INDEX(P61:V61,0, MATCH($AB$1,$P$1:$V$1,0))","v":0.84726671797188313},null,"Electricity",6,0.84726671797188313]
[null,null,null,null,null,null,null,null,null,null,null,null,null,7,"Electricity",{"$f":"INDEX(Calculator!$D$6:$CM$36,MATCH($N62&P$2,Calculator!$A$6:$A$36,0),MATCH(P$1&$O62,Calculator!$D$2:$CM$2,0))","v":0.84362183838221783},{"$f":"INDEX(Calculator!$D$6:$CM$36,MATCH($N62&Q$2,Calculator!$A$6:$A$36,0),MATCH(Q$1&$O62,Calculator!$D$2:$CM$2,0))","v":0.85075500740042775},null,28,"Natural Gas",{"$f":"INDEX(Calculator!$D$6:$CM$36,MATCH($S62&U$2,Calculator!$A$6:$A$36,0),MATCH(U$1&$T62,Calculator!$D$2:$CM$2,0))","v":0.88061034203686706},{"$f":"INDEX(Calculator!$D$6:$CM$36,MATCH($S62&V$2,Calculator!$A$6:$A$36,0),MATCH(V$1&$T62,Calculator!$D$2:$CM$2,0))","v":0.99566398613709484},null,null,null,null,null,7,"Electricity",{"$f":"INDEX(P62:V62,0, MATCH($AB$1,$P$1:$V$1,0))","v":0.85075500740042775},null,"Electricity",7,0.85075500740042775]
[null,null,null,null,null,null,null,null,null,null,null,null,null,8,"Electricity",{"$f":"INDEX(Calculator!$D$6:$CM$36,MATCH($N63&P$2,Calculator!$A$6:$A$36,0),MATCH(P$1&$O63,Calculator!$D$2:$CM$2,0))","v":0.85237730143056756},{"$f":"INDEX(Calculator!$D$6:$CM$36,MATCH($N63&Q$2,Calculator!$A$6:$A$36,0),MATCH(Q$1&$O63,Calculator!$D$2:$CM$2,0))","v":0.85789638148666936},null,29,"Natural Gas",{"$f":"INDEX(Calculator!$D$6:$CM$36,MATCH($S63&U$2,Calculator!$A$6:$A$36,0),MATCH(U$1&$T63,Calculator!$D$2:$CM$2,0))","v":0.90102954486751574},{"$f":"INDEX(Calculator!$D$6:$CM$36,MATCH($S63&V$2,Calculator!$A$6:$A$36,0),MATCH(V$1&$T63,Calculator!$D$2:$CM$2,0))","v":1.0128345397610057},null,null,null,null,null,8,"Electricity",{"$f":"INDEX(P63:V63,0, MATCH($AB$1,$P$1:$V$1,0))","v":0.85789638148666936},null,"Electricity",8,0.85789638148666936]
[null,null,null,null,null,null,null,null,null,null,null,null,null,9,"Electricity",{"$f":"INDEX(Calculator!$D$6:$CM$36,MATCH($N64&P$2,Calculator!$A$6:$A$36,0),MATCH(P$1&$O64,Calculator!$D$2:$CM$2,0))","v":0.86307059287030707},{"$f":"INDEX(Calculator!$D$6:$CM$36,MATCH($N64&Q$2,Calculator!$A$6:$A$36,0),MATCH(Q$1&$O64,Calculator!$D$2:$CM$2,0))","v":0.86733719205736348},null,30,"Natural Gas",{"$f":"INDEX(Calculator!$D$6:$CM$36,MATCH($S64&U$2,Calculator!$A$6:$A$36,0),MATCH(U$1&$T64,Calculator!$D$2:$CM$2,0))","v":0.92192221913534389},{"$f":"INDEX(Calculator!$D$6:$CM$36,MATCH($S64&V$2,Calculator!$A$6:$A$36,0),MATCH(V$1&$T64,Calculator!$D$2:$CM$2,0))","v":1.0304032365822242},null,null,null,null,null,9,"Electricity",{"$f":"INDEX(P64:V64,0, MATCH($AB$1,$P$1:$V$1,0))","v":0.86733719205736348},null,"Electricity",9,0.86733719205736348]
[null,null,null,null,null,null,null,null,null,null,null,null,null,10,"Electricity",{"$f":"INDEX(Calculator!$D$6:$CM$36,MATCH($N65&P$2,Calculator!$A$6:$A$36,0),MATCH(P$1&$O65,Calculator!$D$2:$CM$2,0))","v":0.8743015768109712},{"$f":"INDEX(Calculator!$D$6:$CM$36,MATCH($N65&Q$2,Calculator!$A$6:$A$36,0),MATCH(Q$1&$O65,Calculator!$D$2:$CM$2,0))","v":0.87725271643111047},null,0,"Propane",{"$f":"INDEX(Calculator!$D$6:$CM$36,MATCH($S65&U$2,Calculator!$A$6:$A$36,0),MATCH(U$1&$T65,Calculator!$D$2:$CM$2,0))","v":1},{"$f":"INDEX(Calculator!$D$6:$CM$36,MATCH($S65&V$2,Calculator!$A$6:$A$36,0),MATCH(V$1&$T65,Calculator!$D$2:$CM$2,0))","v":1},null,null,null,null,null,10,"Electricity",{"$f":"INDEX(P65:V65,0, MATCH($AB$1,$P$1:$V$1,0))","v":0.87725271643111047},null,"Electricity",10,0.87725271643111047]
[null,null,null,null,null,null,null,null,null,null,null,null,null,11,"Electricity",{"$f":"INDEX(Calculator!$D$6:$CM$36,MATCH($N66&P$2,Calculator!$A$6:$A$36,0),MATCH(P$1&$O66,Calculator!$D$2:$CM$2,0))","v":0.88463585004845546},{"$f":"INDEX(Calculator!$D$6:$CM$36,MATCH($N66&Q$2,Calculator!$A$6:$A$36,0),MATCH(Q$1&$O66,Calculator!$D$2:$CM$2,0))","v":0.88814230433942498},null,1,"Propane",{"$f":"INDEX(Calculator!$D$6:$CM$36,MATCH($S66&U$2,Calculator!$A$6:$A$36,0),MATCH(U$1&$T66,Calculator!$D$2:$CM$2,0))","v":1.0230244088275893},{"$f":"INDEX(Calculator!$D$6:$CM$36,MATCH($S66&V$2,Calculator!$A$6:$A$36,0),MATCH(V$1&$T66,Calculator!$D$2:$CM$2,0))","v":1.0225543509037718},null,null,null,null,null,11,"Electricity",{"$f":"INDEX(P66:V66,0, MATCH($AB$1,$P$1:$V$1,0))","v":0.88814230433942498},null,"Electricity",11,0.88814230433942498]
[null,null,null,null,null,null,null,null,null,null,null,null,null,12,"Electricity",{"$f":"INDEX(Calculator!$D$6:$CM$36,MATCH($N67&P$2,Calculator!$A$6:$A$36,0),MATCH(P$1&$O67,Calculator!$D$2:$CM$2,0))","v":0.89390659926212412},{"$f":"INDEX(Calculator!$D$6:$CM$36,MATCH($N67&Q$2,Calculator!$A$6:$A$36,0),MATCH(Q$1&$O67,Calculator!$D$2:$CM$2,0))","v":0.89397286574054513},null,2,"Propane",{"$f":"INDEX(Calculator!$D$6:$CM$36,MATCH($S67&U$2,Calculator!$A$6:$A$36,0),MATCH(U$1&$T67,Calculator!$D$2:$CM$2,0))","v":0.9984701685970151},{"$f":"INDEX(Calculator!$D$6:$CM$36,MATCH($S67&V$2,Calculator!$A$6:$A$36,0),MATCH(V$1&$T67,Calculator!$D$2:$CM$2,0))","v":1.0029107349278659},null,null,null,null,null,12,"Electricity",{"$f":"INDEX(P67:V67,0, MATCH($AB$1,$P$1:$V$1,0))","v":0.89397286574054513},null,"Electricity",12,0.89397286574054513]
[null,null,null,null,null,null,null,null,null,null,null,null,null,13,"Electricity",{"$f":"INDEX(Calculator!$D$6:$CM$36,MATCH($N68&P$2,Calculator!$A$6:$A$36,0),MATCH(P$1&$O68,Calculator!$D$2:$CM$2,0))","v":0.90148413861450183},{"$f":"INDEX(Calculator!$D$6:$CM$36,MATCH($N68&Q$2,Calculator!$A$6:$A$36,0),MATCH(Q$1&$O68,Calculator!$D$2:$CM$2,0))","v":0.89948570213169665},null,3,"Propane",{"$f":"INDEX(Calculator!$D$6:$CM$36,MATCH($S68&U$2,Calculator!$A$6:$A$36,0),MATCH(U$1&$T68,Calculator!$D$2:$CM$2,0))","v":0.96304835584401083},{"$f":"INDEX(Calculator!$D$6:$CM$36,MATCH($S68&V$2,Calculator!$A$6:$A$36,0),MATCH(V$1&$T68,Calculator!$D$2:$CM$2,0))","v":0.97362856311983892},null,null,null,null,null,13,"Electricity",{"$f":"INDEX(P68:V68,0, MATCH($AB$1,$P$1:$V$1,0))","v":0.89948570213169665},null,{"$f":"AC68","v":"Electricity"},{"$f":"AB68","v":13},0.89948570213169665]
[null,null,null,null,null,null,null,null,null,null,null,null,null,14,"Electricity",{"$f":"INDEX(Calculator!$D$6:$CM$36,MATCH($N69&P$2,Calculator!$A$6:$A$36,0),MATCH(P$1&$O69,Calculator!$D$2:$CM$2,0))","v":0.91082165652319014},{"$f":"INDEX(Calculator!$D$6:$CM$36,MATCH($N69&Q$2,Calculator!$A$6:$A$36,0),MATCH(Q$1&$O69,Calculator!$D$2:$CM$2,0))","v":0.90772953783683652},null,4,"Propane",{"$f":"INDEX(Calculator!$D$6:$CM$36,MATCH($S69&U$2,Calculator!$A$6:$A$36,0),MATCH(U$1&$T69,Calculator!$D$2:$CM$2,0))","v":0.9326200316050387},{"$f":"INDEX(Calculator!$D$6:$CM$36,MATCH($S69&V$2,Calculator!$A$6:$A$36,0),MATCH(V$1&$T69,Calculator!$D$2:$CM$2,0))","v":0.94877516487096869},null,null,null,null,null,14,"Electricity",{"$f":"INDEX(P69:V69,0, MATCH($AB$1,$P$1:$V$1,0))","v":0.90772953783683652},null,"Electricity",14,0.90772953783683652]
[null,null,null,null,null,null,null,null,null,null,null,null,null,15,"Electricity",{"$f":"INDEX(Calculator!$D$6:$CM$36,MATCH($N70&P$2,Calculator!$A$6:$A$36,0),MATCH(P$1&$O70,Calculator!$D$2:$CM$2,0))","v":0.92203331918195996},{"$f":"INDEX(Calculator!$D$6:$CM$36,MATCH($N70&Q$2,Calculator!$A$6:$A$36,0),MATCH(Q$1&$O70,Calculator!$D$2:$CM$2,0))","v":0.91821658550496765},null,5,"Propane",{"$f":"INDEX(Calculator!$D$6:$CM$36,MATCH($S70&U$2,Calculator!$A$6:$A$36,0),MATCH(U$1&$T70,Calculator!$D$2:$CM$2,0))","v":0.9131031703876481},{"$f":"INDEX(Calculator!$D$6:$CM$36,MATCH($S70&V$2,Calculator!$A$6:$A$36,0),MATCH(V$1&$T70,Calculator!$D$2:$CM$2,0))","v":0.93573302800871294},null,null,null,null,null,15,"Electricity",{"$f":"INDEX(P70:V70,0, MATCH($AB$1,$P$1:$V$1,0))","v":0.91821658550496765},null,"Electricity",15,0.91821658550496765]
[null,null,null,null,null,null,null,null,null,null,null,null,null,16,"Electricity",{"$f":"INDEX(Calculator!$D$6:$CM$36,MATCH($N71&P$2,Calculator!$A$6:$A$36,0),MATCH(P$1&$O71,Calculator!$D$2:$CM$2,0))","v":0.93182764230163784},{"$f":"INDEX(Calculator!$D$6:$CM$36,MATCH($N71&Q$2,Calculator!$A$6:$A$36,0),MATCH(Q$1&$O71,Calculator!$D$2:$CM$2,0))","v":0.92745230338578988},null,6,"Propane",{"$f":"INDEX(Calculator!$D$6:$CM$36,MATCH($S71&U$2,Calculator!$A$6:$A$36,0),MATCH(U$1&$T71,Calculator!$D$2:$CM$2,0))","v":0.9042516755187644},{"$f":"INDEX(Calculator!$D$6:$CM$36,MATCH($S71&V$2,Calculator!$A$6:$A$36,0),MATCH(V$1&$T71,Calculator!$D$2:$CM$2,0))","v":0.93001632971141923},null,null,null,null,null,16,"Electricity",{"$f":"INDEX(P71:V71,0, MATCH($AB$1,$P$1:$V$1,0))","v":0.92745230338578988},null,"Electricity",16,0.92745230338578988]
[null,null,null,null,null,null,null,null,null,null,null,null,null,17,"Electricity",{"$f":"INDEX(Calculator!$D$6:$CM$36,MATCH($N72&P$2,Calculator!$A$6:$A$36,0),MATCH(P$1&$O72,Calculator!$D$2:$CM$2,0))","v":0.93989496388154936},{"$f":"INDEX(Calculator!$D$6:$CM$36,MATCH($N72&Q$2,Calculator!$A$6:$A$36,0),MATCH(Q$1&$O72,Calculator!$D$2:$CM$2,0))","v":0.9357518810019565},null,7,"Propane",{"$f":"INDEX(Calculator!$D$6:$CM$36,MATCH($S72&U$2,Calculator!$A$6:$A$36,0),MATCH(U$1&$T72,Calculator!$D$2:$CM$2,0))","v":0.90472467163879389},{"$f":"INDEX(Calculator!$D$6:$CM$36,MATCH($S72&V$2,Calculator!$A$6:$A$36,0),MATCH(V$1&$T72,Calculator!$D$2:$CM$2,0))","v":0.93256961321707676},null,null,null,null,null,17,"Electricity",{"$f":"INDEX(P72:V72,0, MATCH($AB$1,$P$1:$V$1,0))","v":0.9357518810019565},null,"Electricity",17,0.9357518810019565]
[null,null,null,null,null,null,null,null,null,null,null,null,null,18,"Electricity",{"$f":"INDEX(Calculator!$D$6:$CM$36,MATCH($N73&P$2,Calculator!$A$6:$A$36,0),MATCH(P$1&$O73,Calculator!$D$2:$CM$2,0))","v":0.94907380726890966},{"$f":"INDEX(Calculator!$D$6:$CM$36,MATCH($N73&Q$2,Calculator!$A$6:$A$36,0),MATCH(Q$1&$O73,Calculator!$D$2:$CM$2,0))","v":0.9438556273710208},null,8,"Propane",{"$f":"INDEX(Calculator!$D$6:$CM$36,MATCH($S73&U$2,Calculator!$A$6:$A$36,0),MATCH(U$1&$T73,Calculator!$D$2:$CM$2,0))","v":0.91226092544246129},{"$f":"INDEX(Calculator!$D$6:$CM$36,MATCH($S73&V$2,Calculator!$A$6:$A$36,0),MATCH(V$1&$T73,Calculator!$D$2:$CM$2,0))","v":0.9413873687011719},null,null,null,null,null,18,"Electricity",{"$f":"INDEX(P73:V73,0, MATCH($AB$1,$P$1:$V$1,0))","v":0.9438556273710208},null,"Electricity",18,0.9438556273710208]
[null,null,null,null,null,null,null,null,null,null,null,null,null,19,"Electricity",{"$f":"INDEX(Calculator!$D$6:$CM$36,MATCH($N74&P$2,Calculator!$A$6:$A$36,0),MATCH(P$1&$O74,Calculator!$D$2:$CM$2,0))","v":0.95699045465323618},{"$f":"INDEX(Calculator!$D$6:$CM$36,MATCH($N74&Q$2,Calculator!$A$6:$A$36,0),MATCH(Q$1&$O74,Calculator!$D$2:$CM$2,0))","v":0.9520221789169242},null,9,"Propane",{"$f":"INDEX(Calculator!$D$6:$CM$36,MATCH($S74&U$2,Calculator!$A$6:$A$36,0),MATCH(U$1&$T74,Calculator!$D$2:$CM$2,0))","v":0.92562041898224612},{"$f":"INDEX(Calculator!$D$6:$CM$36,MATCH($S74&V$2,Calculator!$A$6:$A$36,0),MATCH(V$1&$T74,Calculator!$D$2:$CM$2,0))","v":0.95536981217833505},null,null,null,null,null,19,"Electricity",{"$f":"INDEX(P74:V74,0, MATCH($AB$1,$P$1:$V$1,0))","v":0.9520221789169242},null,"Electricity",19,0.9520221789169242]
[null,null,null,null,null,null,null,null,null,null,null,null,null,20,"Electricity",{"$f":"INDEX(Calculator!$D$6:$CM$36,MATCH($N75&P$2,Calculator!$A$6:$A$36,0),MATCH(P$1&$O75,Calculator!$D$2:$CM$2,0))","v":0.9645589342359413},{"$f":"INDEX(Calculator!$D$6:$CM$36,MATCH($N75&Q$2,Calculator!$A$6:$A$36,0),MATCH(Q$1&$O75,Calculator!$D$2:$CM$2,0))","v":0.95929276124420948},null,10,"Propane",{"$f":"INDEX(Calculator!$D$6:$CM$36,MATCH($S75&U$2,Calculator!$A$6:$A$36,0),MATCH(U$1&$T75,Calculator!$D$2:$CM$2,0))","v":0.94342561207875375},{"$f":"INDEX(Calculator!$D$6:$CM$36,MATCH($S75&V$2,Calculator!$A$6:$A$36,0),MATCH(V$1&$T75,Calculator!$D$2:$CM$2,0))","v":0.97329518985739738},null,null,null,null,null,20,"Electricity",{"$f":"INDEX(P75:V75,0, MATCH($AB$1,$P$1:$V$1,0))","v":0.95929276124420948},null,"Electricity",20,{"$f":"AD75","v":0.95929276124420948}]
[null,null,null,null,null,null,null,null,null,null,null,null,null,21,"Electricity",{"$f":"INDEX(Calculator!$D$6:$CM$36,MATCH($N76&P$2,Calculator!$A$6:$A$36,0),MATCH(P$1&$O76,Calculator!$D$2:$CM$2,0))","v":0.97340569043555225},{"$f":"INDEX(Calculator!$D$6:$CM$36,MATCH($N76&Q$2,Calculator!$A$6:$A$36,0),MATCH(Q$1&$O76,Calculator!$D$2:$CM$2,0))","v":0.96886906159701491},null,11,"Propane",{"$f":"INDEX(Calculator!$D$6:$CM$36,MATCH($S76&U$2,Calculator!$A$6:$A$36,0),MATCH(U$1&$T76,Calculator!$D$2:$CM$2,0))","v":0.96226126106868259},{"$f":"INDEX(Calculator!$D$6:$CM$36,MATCH($S76&V$2,Calculator!$A$6:$A$36,0),MATCH(V$1&$T76,Calculator!$D$2:$CM$2,0))","v":0.99213448889661426},null,null,null,null,null,21,"Electricity",{"$f":"INDEX(P76:V76,0, MATCH($AB$1,$P$1:$V$1,0))","v":0.96886906159701491},null,"Electricity",21,0.96886906159701491]
[null,null,null,null,null,null,null,null,null,null,null,null,null,22,"Electricity",{"$f":"INDEX(Calculator!$D$6:$CM$36,MATCH($N77&P$2,Calculator!$A$6:$A$36,0),MATCH(P$1&$O77,Calculator!$D$2:$CM$2,0))","v":0.98259960897921395},{"$f":"INDEX(Calculator!$D$6:$CM$36,MATCH($N77&Q$2,Calculator!$A$6:$A$36,0),MATCH(Q$1&$O77,Calculator!$D$2:$CM$2,0))","v":0.97698611740366148},null,12,"Propane",{"$f":"INDEX(Calculator!$D$6:$CM$36,MATCH($S77&U$2,Calculator!$A$6:$A$36,0),MATCH(U$1&$T77,Calculator!$D$2:$CM$2,0))","v":0.97828506348502164},{"$f":"INDEX(Calculator!$D$6:$CM$36,MATCH($S77&V$2,Calculator!$A$6:$A$36,0),MATCH(V$1&$T77,Calculator!$D$2:$CM$2,0))","v":1.0084799338451442},null,null,null,null,null,22,"Electricity",{"$f":"INDEX(P77:V77,0, MATCH($AB$1,$P$1:$V$1,0))","v":0.97698611740366148},null,"Electricity",22,0.97698611740366148]
[null,null,null,null,null,null,null,null,null,null,null,null,null,23,"Electricity",{"$f":"INDEX(Calculator!$D$6:$CM$36,MATCH($N78&P$2,Calculator!$A$6:$A$36,0),MATCH(P$1&$O78,Calculator!$D$2:$CM$2,0))","v":0.99083640381687654},{"$f":"INDEX(Calculator!$D$6:$CM$36,MATCH($N78&Q$2,Calculator!$A$6:$A$36,0),MATCH(Q$1&$O78,Calculator!$D$2:$CM$2,0))","v":0.9842581552238463},null,13,"Propane",{"$f":"INDEX(Calculator!$D$6:$CM$36,MATCH($S78&U$2,Calculator!$A$6:$A$36,0),MATCH(U$1&$T78,Calculator!$D$2:$CM$2,0))","v":0.99051258041591295},{"$f":"INDEX(Calculator!$D$6:$CM$36,MATCH($S78&V$2,Calculator!$A$6:$A$36,0),MATCH(V$1&$T78,Calculator!$D$2:$CM$2,0))","v":1.0214584162516123},null,null,null,null,null,23,"Electricity",{"$f":"INDEX(P78:V78,0, MATCH($AB$1,$P$1:$V$1,0))","v":0.9842581552238463},null,"Electricity",23,0.9842581552238463]
[null,null,null,null,null,null,null,null,null,null,null,null,null,24,"Electricity",{"$f":"INDEX(Calculator!$D$6:$CM$36,MATCH($N79&P$2,Calculator!$A$6:$A$36,0),MATCH(P$1&$O79,Calculator!$D$2:$CM$2,0))","v":6.4536674224534094},{"$f":"INDEX(Calculator!$D$6:$CM$36,MATCH($N79&Q$2,Calculator!$A$6:$A$36,0),MATCH(Q$1&$O79,Calculator!$D$2:$CM$2,0))","v":6.4002935504658378},null,14,"Propane",{"$f":"INDEX(Calculator!$D$6:$CM$36,MATCH($S79&U$2,Calculator!$A$6:$A$36,0),MATCH(U$1&$T79,Calculator!$D$2:$CM$2,0))","v":1.0008712437542604},{"$f":"INDEX(Calculator!$D$6:$CM$36,MATCH($S79&V$2,Calculator!$A$6:$A$36,0),MATCH(V$1&$T79,Calculator!$D$2:$CM$2,0))","v":1.0349131728630421},null,null,null,null,null,24,"Electricity",{"$f":"INDEX(P79:V79,0, MATCH($AB$1,$P$1:$V$1,0))","v":6.4002935504658378},null,"Electricity",24,6.4002935504658378]
[null,null,null,null,null,null,null,null,null,null,null,null,null,25,"Electricity",{"$f":"INDEX(Calculator!$D$6:$CM$36,MATCH($N80&P$2,Calculator!$A$6:$A$36,0),MATCH(P$1&$O80,Calculator!$D$2:$CM$2,0))","v":-4.6218301415624117},{"$f":"INDEX(Calculator!$D$6:$CM$36,MATCH($N80&Q$2,Calculator!$A$6:$A$36,0),MATCH(Q$1&$O80,Calculator!$D$2:$CM$2,0))","v":-4.5818544727261985},null,15,"Propane",{"$f":"INDEX(Calculator!$D$6:$CM$36,MATCH($S80&U$2,Calculator!$A$6:$A$36,0),MATCH(U$1&$T80,Calculator!$D$2:$CM$2,0))","v":1.0131174758312005},{"$f":"INDEX(Calculator!$D$6:$CM$36,MATCH($S80&V$2,Calculator!$A$6:$A$36,0),MATCH(V$1&$T80,Calculator!$D$2:$CM$2,0))","v":1.0479082539146745},null,null,null,null,null,25,"Electricity",{"$f":"INDEX(P80:V80,0, MATCH($AB$1,$P$1:$V$1,0))","v":-4.5818544727261985},null,"Electricity",25,-4.5818544727261985]
[null,null,null,null,null,null,null,null,null,null,null,null,null,0,"Propane",{"$f":"INDEX(Calculator!$D$6:$CM$36,MATCH($N81&P$2,Calculator!$A$6:$A$36,0),MATCH(P$1&$O81,Calculator!$D$2:$CM$2,0))","v":1},{"$f":"INDEX(Calculator!$D$6:$CM$36,MATCH($N81&Q$2,Calculator!$A$6:$A$36,0),MATCH(Q$1&$O81,Calculator!$D$2:$CM$2,0))","v":1},null,16,"Propane",{"$f":"INDEX(Calculator!$D$6:$CM$36,MATCH($S81&U$2,Calculator!$A$6:$A$36,0),MATCH(U$1&$T81,Calculator!$D$2:$CM$2,0))","v":1.021084378445011},{"$f":"INDEX(Calculator!$D$6:$CM$36,MATCH($S81&V$2,Calculator!$A$6:$A$36,0),MATCH(V$1&$T81,Calculator!$D$2:$CM$2,0))","v":1.0571079560195109},null,null,null,null,null,0,"Propane",{"$f":"INDEX(P81:V81,0, MATCH($AB$1,$P$1:$V$1,0))","v":1},null,"Propane",0,1]
[null,null,null,null,null,null,null,null,null,null,null,null,null,1,"Propane",{"$f":"INDEX(Calculator!$D$6:$CM$36,MATCH($N82&P$2,Calculator!$A$6:$A$36,0),MATCH(P$1&$O82,Calculator!$D$2:$CM$2,0))","v":1.0230244088275893},{"$f":"INDEX(Calculator!$D$6:$CM$36,MATCH($N82&Q$2,Calculator!$A$6:$A$36,0),MATCH(Q$1&$O82,Calculator!$D$2:$CM$2,0))","v":1.0225543509037718},null,17,"Propane",{"$f":"INDEX(Calculator!$D$6:$CM$36,MATCH($S82&U$2,Calculator!$A$6:$A$36,0),MATCH(U$1&$T82,Calculator!$D$2:$CM$2,0))","v":1.0303537378873688},{"$f":"INDEX(Calculator!$D$6:$CM$36,MATCH($S82&V$2,Calculator!$A$6:$A$36,0),MATCH(V$1&$T82,Calculator!$D$2:$CM$2,0))","v":1.067462819760947},null,null,null,null,null,1,"Propane",{"$f":"INDEX(P82:V82,0, MATCH($AB$1,$P$1:$V$1,0))","v":1.0225543509037718},null,"Propane",1,1.0225543509037718]
[null,null,null,null,null,null,null,null,null,null,null,null,null,2,"Propane",{"$f":"INDEX(Calculator!$D$6:$CM$36,MATCH($N83&P$2,Calculator!$A$6:$A$36,0),MATCH(P$1&$O83,Calculator!$D$2:$CM$2,0))","v":0.9984701685970151},{"$f":"INDEX(Calculator!$D$6:$CM$36,MATCH($N83&Q$2,Calculator!$A$6:$A$36,0),MATCH(Q$1&$O83,Calculator!$D$2:$CM$2,0))","v":1.0029107349278659},null,18,"Propane",{"$f":"INDEX(Calculator!$D$6:$CM$36,MATCH($S83&U$2,Calculator!$A$6:$A$36,0),MATCH(U$1&$T83,Calculator!$D$2:$CM$2,0))","v":1.0404742772787023},{"$f":"INDEX(Calculator!$D$6:$CM$36,MATCH($S83&V$2,Calculator!$A$6:$A$36,0),MATCH(V$1&$T83,Calculator!$D$2:$CM$2,0))","v":1.0785726032827161},null,null,null,null,null,2,"Propane",{"$f":"INDEX(P83:V83,0, MATCH($AB$1,$P$1:$V$1,0))","v":1.0029107349278659},null,"Propane",2,1.0029107349278659]
[null,null,null,null,null,null,null,null,null,null,null,null,null,3,"Propane",{"$f":"INDEX(Calculator!$D$6:$CM$36,MATCH($N84&P$2,Calculator!$A$6:$A$36,0),MATCH(P$1&$O84,Calculator!$D$2:$CM$2,0))","v":0.96304835584401083},{"$f":"INDEX(Calculator!$D$6:$CM$36,MATCH($N84&Q$2,Calculator!$A$6:$A$36,0),MATCH(Q$1&$O84,Calculator!$D$2:$CM$2,0))","v":0.97362856311983892},null,19,"Propane",{"$f":"INDEX(Calculator!$D$6:$CM$36,MATCH($S84&U$2,Calculator!$A$6:$A$36,0),MATCH(U$1&$T84,Calculator!$D$2:$CM$2,0))","v":1.0483516471054155},{"$f":"INDEX(Calculator!$D$6:$CM$36,MATCH($S84&V$2,Calculator!$A$6:$A$36,0),MATCH(V$1&$T84,Calculator!$D$2:$CM$2,0))","v":1.0876928978873526},null,null,null,null,null,3,"Propane",{"$f":"INDEX(P84:V84,0, MATCH($AB$1,$P$1:$V$1,0))","v":0.97362856311983892},null,"Propane",3,0.97362856311983892]
[null,null,null,null,null,null,null,null,null,null,null,null,null,4,"Propane",{"$f":"INDEX(Calculator!$D$6:$CM$36,MATCH($N85&P$2,Calculator!$A$6:$A$36,0),MATCH(P$1&$O85,Calculator!$D$2:$CM$2,0))","v":0.9326200316050387},{"$f":"INDEX(Calculator!$D$6:$CM$36,MATCH($N85&Q$2,Calculator!$A$6:$A$36,0),MATCH(Q$1&$O85,Calculator!$D$2:$CM$2,0))","v":0.94877516487096869},null,20,"Propane",{"$f":"INDEX(Calculator!$D$6:$CM$36,MATCH($S85&U$2,Calculator!$A$6:$A$36,0),MATCH(U$1&$T85,Calculator!$D$2:$CM$2,0))","v":1.0528491335810979},{"$f":"INDEX(Calculator!$D$6:$CM$36,MATCH($S85&V$2,Calculator!$A$6:$A$36,0),MATCH(V$1&$T85,Calculator!$D$2:$CM$2,0))","v":1.0938155410553203},null,null,null,null,null,4,"Propane",{"$f":"INDEX(P85:V85,0, MATCH($AB$1,$P$1:$V$1,0))","v":0.94877516487096869},null,"Propane",4,0.94877516487096869]
[null,null,null,null,null,null,null,null,null,null,null,null,null,5,"Propane",{"$f":"INDEX(Calculator!$D$6:$CM$36,MATCH($N86&P$2,Calculator!$A$6:$A$36,0),MATCH(P$1&$O86,Calculator!$D$2:$CM$2,0))","v":0.9131031703876481},{"$f":"INDEX(Calculator!$D$6:$CM$36,MATCH($N86&Q$2,Calculator!$A$6:$A$36,0),MATCH(Q$1&$O86,Calculator!$D$2:$CM$2,0))","v":0.93573302800871294},null,21,"Propane",{"$f":"INDEX(Calculator!$D$6:$CM$36,MATCH($S86&U$2,Calculator!$A$6:$A$36,0),MATCH(U$1&$T86,Calculator!$D$2:$CM$2,0))","v":1.0543706834817048},{"$f":"INDEX(Calculator!$D$6:$CM$36,MATCH($S86&V$2,Calculator!$A$6:$A$36,0),MATCH(V$1&$T86,Calculator!$D$2:$CM$2,0))","v":1.0994325757570367},null,null,null,null,null,5,"Propane",{"$f":"INDEX(P86:V86,0, MATCH($AB$1,$P$1:$V$1,0))","v":0.93573302800871294},null,"Propane",5,0.93573302800871294]
[null,null,null,null,null,null,null,null,null,null,null,null,null,6,"Propane",{"$f":"INDEX(Calculator!$D$6:$CM$36,MATCH($N87&P$2,Calculator!$A$6:$A$36,0),MATCH(P$1&$O87,Calculator!$D$2:$CM$2,0))","v":0.9042516755187644},{"$f":"INDEX(Calculator!$D$6:$CM$36,MATCH($N87&Q$2,Calculator!$A$6:$A$36,0),MATCH(Q$1&$O87,Calculator!$D$2:$CM$2,0))","v":0.93001632971141923},null,22,"Propane",{"$f":"INDEX(Calculator!$D$6:$CM$36,MATCH($S87&U$2,Calculator!$A$6:$A$36,0),MATCH(U$1&$T87,Calculator!$D$2:$CM$2,0))","v":1.0573361850681946},{"$f":"INDEX(Calculator!$D$6:$CM$36,MATCH($S87&V$2,Calculator!$A$6:$A$36,0),MATCH(V$1&$T87,Calculator!$D$2:$CM$2,0))","v":1.1041964866176772},null,null,null,null,null,6,"Propane",{"$f":"INDEX(P87:V87,0, MATCH($AB$1,$P$1:$V$1,0))","v":0.93001632971141923},null,"Propane",6,0.93001632971141923]
[null,null,null,null,null,null,null,null,null,null,null,null,null,7,"Propane",{"$f":"INDEX(Calculator!$D$6:$CM$36,MATCH($N88&P$2,Calculator!$A$6:$A$36,0),MATCH(P$1&$O88,Calculator!$D$2:$CM$2,0))","v":0.90472467163879389},{"$f":"INDEX(Calculator!$D$6:$CM$36,MATCH($N88&Q$2,Calculator!$A$6:$A$36,0),MATCH(Q$1&$O88,Calculator!$D$2:$CM$2,0))","v":0.93256961321707676},null,23,"Propane",{"$f":"INDEX(Calculator!$D$6:$CM$36,MATCH($S88&U$2,Calculator!$A$6:$A$36,0),MATCH(U$1&$T88,Calculator!$D$2:$CM$2,0))","v":1.0849084190407647},{"$f":"INDEX(Calculator!$D$6:$CM$36,MATCH($S88&V$2,Calculator!$A$6:$A$36,0),MATCH(V$1&$T88,Calculator!$D$2:$CM$2,0))","v":1.1307843479014483},null,null,null,null,null,7,"Propane",{"$f":"INDEX(P88:V88,0, MATCH($AB$1,$P$1:$V$1,0))","v":0.93256961321707676},null,"Propane",7,0.93256961321707676]
[null,null,null,null,null,null,null,null,null,null,null,null,null,8,"Propane",{"$f":"INDEX(Calculator!$D$6:$CM$36,MATCH($N89&P$2,Calculator!$A$6:$A$36,0),MATCH(P$1&$O89,Calculator!$D$2:$CM$2,0))","v":0.91226092544246129},{"$f":"INDEX(Calculator!$D$6:$CM$36,MATCH($N89&Q$2,Calculator!$A$6:$A$36,0),MATCH(Q$1&$O89,Calculator!$D$2:$CM$2,0))","v":0.9413873687011719},null,24,"Propane",{"$f":"INDEX(Calculator!$D$6:$CM$36,MATCH($S89&U$2,Calculator!$A$6:$A$36,0),MATCH(U$1&$T89,Calculator!$D$2:$CM$2,0))","v":1.0945935135443363},{"$f":"INDEX(Calculator!$D$6:$CM$36,MATCH($S89&V$2,Calculator!$A$6:$A$36,0),MATCH(V$1&$T89,Calculator!$D$2:$CM$2,0))","v":1.1415079311145613},null,null,null,null,null,8,"Propane",{"$f":"INDEX(P89:V89,0, MATCH($AB$1,$P$1:$V$1,0))","v":0.9413873687011719},null,"Propane",8,0.9413873687011719]
[null,null,null,null,null,null,null,null,null,null,null,null,null,9,"Propane",{"$f":"INDEX(Calculator!$D$6:$CM$36,MATCH($N90&P$2,Calculator!$A$6:$A$36,0),MATCH(P$1&$O90,Calculator!$D$2:$CM$2,0))","v":0.92562041898224612},{"$f":"INDEX(Calculator!$D$6:$CM$36,MATCH($N90&Q$2,Calculator!$A$6:$A$36,0),MATCH(Q$1&$O90,Calculator!$D$2:$CM$2,0))","v":0.95536981217833505},null,25,"Propane",{"$f":"INDEX(Calculator!$D$6:$CM$36,MATCH($S90&U$2,Calculator!$A$6:$A$36,0),MATCH(U$1&$T90,Calculator!$D$2:$CM$2,0))","v":1.096638909505822},{"$f":"INDEX(Calculator!$D$6:$CM$36,MATCH($S90&V$2,Calculator!$A$6:$A$36,0),MATCH(V$1&$T90,Calculator!$D$2:$CM$2,0))","v":1.1454557913420225},null,null,null,null,null,9,"Propane",{"$f":"INDEX(P90:V90,0, MATCH($AB$1,$P$1:$V$1,0))","v":0.95536981217833505},null,"Propane",9,0.95536981217833505]
[null,null,null,null,null,null,null,null,null,null,null,null,null,10,"Propane",{"$f":"INDEX(Calculator!$D$6:$CM$36,MATCH($N91&P$2,Calculator!$A$6:$A$36,0),MATCH(P$1&$O91,Calculator!$D$2:$CM$2,0))","v":0.94342561207875375},{"$f":"INDEX(Calculator!$D$6:$CM$36,MATCH($N91&Q$2,Calculator!$A$6:$A$36,0),MATCH(Q$1&$O91,Calculator!$D$2:$CM$2,0))","v":0.97329518985739738},null,26,"Propane",{"$f":"INDEX(Calculator!$D$6:$CM$36,MATCH($S91&U$2,Calculator!$A$6:$A$36,0),MATCH(U$1&$T91,Calculator!$D$2:$CM$2,0))","v":1.0978007319710439},{"$f":"INDEX(Calculator!$D$6:$CM$36,MATCH($S91&V$2,Calculator!$A$6:$A$36,0),MATCH(V$1&$T91,Calculator!$D$2:$CM$2,0))","v":1.1486200016368104},null,null,null,null,null,10,"Propane",{"$f":"INDEX(P91:V91,0, MATCH($AB$1,$P$1:$V$1,0))","v":0.97329518985739738},null,"Propane",10,0.97329518985739738]
[null,null,null,null,null,null,null,null,null,null,null,null,null,11,"Propane",{"$f":"INDEX(Calculator!$D$6:$CM$36,MATCH($N92&P$2,Calculator!$A$6:$A$36,0),MATCH(P$1&$O92,Calculator!$D$2:$CM$2,0))","v":0.96226126106868259},{"$f":"INDEX(Calculator!$D$6:$CM$36,MATCH($N92&Q$2,Calculator!$A$6:$A$36,0),MATCH(Q$1&$O92,Calculator!$D$2:$CM$2,0))","v":0.99213448889661426},null,27,"Propane",{"$f":"INDEX(Calculator!$D$6:$CM$36,MATCH($S92&U$2,Calculator!$A$6:$A$36,0),MATCH(U$1&$T92,Calculator!$D$2:$CM$2,0))","v":1.0975437921934124},{"$f":"INDEX(Calculator!$D$6:$CM$36,MATCH($S92&V$2,Calculator!$A$6:$A$36,0),MATCH(V$1&$T92,Calculator!$D$2:$CM$2,0))","v":1.1526596765348385},null,null,null,null,null,11,"Propane",{"$f":"INDEX(P92:V92,0, MATCH($AB$1,$P$1:$V$1,0))","v":0.99213448889661426},null,"Propane",11,0.99213448889661426]
[null,null,null,null,null,null,null,null,null,null,null,null,null,12,"Propane",{"$f":"INDEX(Calculator!$D$6:$CM$36,MATCH($N93&P$2,Calculator!$A$6:$A$36,0),MATCH(P$1&$O93,Calculator!$D$2:$CM$2,0))","v":0.97828506348502164},{"$f":"INDEX(Calculator!$D$6:$CM$36,MATCH($N93&Q$2,Calculator!$A$6:$A$36,0),MATCH(Q$1&$O93,Calculator!$D$2:$CM$2,0))","v":1.0084799338451442},null,28,"Propane",{"$f":"INDEX(Calculator!$D$6:$CM$36,MATCH($S93&U$2,Calculator!$A$6:$A$36,0),MATCH(U$1&$T93,Calculator!$D$2:$CM$2,0))","v":1.1034614285369622},{"$f":"INDEX(Calculator!$D$6:$CM$36,MATCH($S93&V$2,Calculator!$A$6:$A$36,0),MATCH(V$1&$T93,Calculator!$D$2:$CM$2,0))","v":1.1600418644413544},null,null,null,null,null,12,"Propane",{"$f":"INDEX(P93:V93,0, MATCH($AB$1,$P$1:$V$1,0))","v":1.0084799338451442},null,"Propane",12,1.0084799338451442]
[null,null,null,null,null,null,null,null,null,null,null,null,null,13,"Propane",{"$f":"INDEX(Calculator!$D$6:$CM$36,MATCH($N94&P$2,Calculator!$A$6:$A$36,0),MATCH(P$1&$O94,Calculator!$D$2:$CM$2,0))","v":0.99051258041591295},{"$f":"INDEX(Calculator!$D$6:$CM$36,MATCH($N94&Q$2,Calculator!$A$6:$A$36,0),MATCH(Q$1&$O94,Calculator!$D$2:$CM$2,0))","v":1.0214584162516123},null,29,"Propane",{"$f":"INDEX(Calculator!$D$6:$CM$36,MATCH($S94&U$2,Calculator!$A$6:$A$36,0),MATCH(U$1&$T94,Calculator!$D$2:$CM$2,0))","v":1.111599717741494},{"$f":"INDEX(Calculator!$D$6:$CM$36,MATCH($S94&V$2,Calculator!$A$6:$A$36,0),MATCH(V$1&$T94,Calculator!$D$2:$CM$2,0))","v":1.167259792337757},null,null,null,null,null,13,"Propane",{"$f":"INDEX(P94:V94,0, MATCH($AB$1,$P$1:$V$1,0))","v":1.0214584162516123},null,"Propane",13,1.0214584162516123]
[null,null,null,null,null,null,null,null,null,null,null,null,null,14,"Propane",{"$f":"INDEX(Calculator!$D$6:$CM$36,MATCH($N95&P$2,Calculator!$A$6:$A$36,0),MATCH(P$1&$O95,Calculator!$D$2:$CM$2,0))","v":1.0008712437542604},{"$f":"INDEX(Calculator!$D$6:$CM$36,MATCH($N95&Q$2,Calculator!$A$6:$A$36,0),MATCH(Q$1&$O95,Calculator!$D$2:$CM$2,0))","v":1.0349131728630421},null,30,"Propane",{"$f":"INDEX(Calculator!$D$6:$CM$36,MATCH($S95&U$2,Calculator!$A$6:$A$36,0),MATCH(U$1&$T95,Calculator!$D$2:$CM$2,0))","v":1.119798028755093},{"$f":"INDEX(Calculator!$D$6:$CM$36,MATCH($S95&V$2,Calculator!$A$6:$A$36,0),MATCH(V$1&$T95,Calculator!$D$2:$CM$2,0))","v":1.1745309541607469},null,null,null,null,null,14,"Propane",{"$f":"INDEX(P95:V95,0, MATCH($AB$1,$P$1:$V$1,0))","v":1.0349131728630421},null,"Propane",14,1.0349131728630421]
[null,null,null,null,null,null,null,null,null,null,null,null,null,15,"Propane",{"$f":"INDEX(Calculator!$D$6:$CM$36,MATCH($N96&P$2,Calculator!$A$6:$A$36,0),MATCH(P$1&$O96,Calculator!$D$2:$CM$2,0))","v":1.0131174758312005},{"$f":"INDEX(Calculator!$D$6:$CM$36,MATCH($N96&Q$2,Calculator!$A$6:$A$36,0),MATCH(Q$1&$O96,Calculator!$D$2:$CM$2,0))","v":1.0479082539146745},null,0,"Oil",{"$f":"INDEX(Calculator!$D$6:$CM$36,MATCH($S96&U$2,Calculator!$A$6:$A$36,0),MATCH(U$1&$T96,Calculator!$D$2:$CM$2,0))","v":1},{"$f":"INDEX(Calculator!$D$6:$CM$36,MATCH($S96&V$2,Calculator!$A$6:$A$36,0),MATCH(V$1&$T96,Calculator!$D$2:$CM$2,0))","v":1},null,null,null,null,null,15,"Propane",{"$f":"INDEX(P96:V96,0, MATCH($AB$1,$P$1:$V$1,0))","v":1.0479082539146745},null,"Propane",15,1.0479082539146745]
[null,null,null,null,null,null,null,null,null,null,null,null,null,16,"Propane",{"$f":"INDEX(Calculator!$D$6:$CM$36,MATCH($N97&P$2,Calculator!$A$6:$A$36,0),MATCH(P$1&$O97,Calculator!$D$2:$CM$2,0))","v":1.021084378445011},{"$f":"INDEX(Calculator!$D$6:$CM$36,MATCH($N97&Q$2,Calculator!$A$6:$A$36,0),MATCH(Q$1&$O97,Calculator!$D$2:$CM$2,0))","v":1.0571079560195109},null,1,"Oil",{"$f":"INDEX(Calculator!$D$6:$CM$36,MATCH($S97&U$2,Calculator!$A$6:$A$36,0),MATCH(U$1&$T97,Calculator!$D$2:$CM$2,0))","v":0.9596828259813811},{"$f":"INDEX(Calculator!$D$6:$CM$36,MATCH($S97&V$2,Calculator!$A$6:$A$36,0),MATCH(V$1&$T97,Calculator!$D$2:$CM$2,0))","v":0.96744096993821582},null,null,null,null,null,16,"Propane",{"$f":"INDEX(P97:V97,0, MATCH($AB$1,$P$1:$V$1,0))","v":1.0571079560195109},null,"Propane",16,1.0571079560195109]
[null,null,null,null,null,null,null,null,null,null,null,null,null,17,"Propane",{"$f":"INDEX(Calculator!$D$6:$CM$36,MATCH($N98&P$2,Calculator!$A$6:$A$36,0),MATCH(P$1&$O98,Calculator!$D$2:$CM$2,0))","v":1.0303537378873688},{"$f":"INDEX(Calculator!$D$6:$CM$36,MATCH($N98&Q$2,Calculator!$A$6:$A$36,0),MATCH(Q$1&$O98,Calculator!$D$2:$CM$2,0))","v":1.067462819760947},null,2,"Oil",{"$f":"INDEX(Calculator!$D$6:$CM$36,MATCH($S98&U$2,Calculator!$A$6:$A$36,0),MATCH(U$1&$T98,Calculator!$D$2:$CM$2,0))","v":0.91330895166801818},{"$f":"INDEX(Calculator!$D$6:$CM$36,MATCH($S98&V$2,Calculator!$A$6:$A$36,0),MATCH(V$1&$T98,Calculator!$D$2:$CM$2,0))","v":0.9296191683567282},null,null,null,null,null,17,"Propane",{"$f":"INDEX(P98:V98,0, MATCH($AB$1,$P$1:$V$1,0))","v":1.067462819760947},null,"Propane",17,1.067462819760947]
[null,null,null,null,null,null,null,null,null,null,null,null,null,18,"Propane",{"$f":"INDEX(Calculator!$D$6:$CM$36,MATCH($N99&P$2,Calculator!$A$6:$A$36,0),MATCH(P$1&$O99,Calculator!$D$2:$CM$2,0))","v":1.0404742772787023},{"$f":"INDEX(Calculator!$D$6:$CM$36,MATCH($N99&Q$2,Calculator!$A$6:$A$36,0),MATCH(Q$1&$O99,Calculator!$D$2:$CM$2,0))","v":1.0785726032827161},null,3,"Oil",{"$f":"INDEX(Calculator!$D$6:$CM$36,MATCH($S99&U$2,Calculator!$A$6:$A$36,0),MATCH(U$1&$T99,Calculator!$D$2:$CM$2,0))","v":0.88964723820021419},{"$f":"INDEX(Calculator!$D$6:$CM$36,MATCH($S99&V$2,Calculator!$A$6:$A$36,0),MATCH(V$1&$T99,Calculator!$D$2:$CM$2,0))","v":0.9115323557019096},null,null,null,null,null,18,"Propane",{"$f":"INDEX(P99:V99,0, MATCH($AB$1,$P$1:$V$1,0))","v":1.0785726032827161},null,"Propane",18,1.0785726032827161]
[null,null,null,null,null,null,null,null,null,null,null,null,null,19,"Propane",{"$f":"INDEX(Calculator!$D$6:$CM$36,MATCH($N100&P$2,Calculator!$A$6:$A$36,0),MATCH(P$1&$O100,Calculator!$D$2:$CM$2,0))","v":1.0483516471054155},{"$f":"INDEX(Calculator!$D$6:$CM$36,MATCH($N100&Q$2,Calculator!$A$6:$A$36,0),MATCH(Q$1&$O100,Calculator!$D$2:$CM$2,0))","v":1.0876928978873526},null,4,"Oil",{"$f":"INDEX(Calculator!$D$6:$CM$36,MATCH($S100&U$2,Calculator!$A$6:$A$36,0),MATCH(U$1&$T100,Calculator!$D$2:$CM$2,0))","v":0.87526585386183964},{"$f":"INDEX(Calculator!$D$6:$CM$36,MATCH($S100&V$2,Calculator!$A$6:$A$36,0),MATCH(V$1&$T100,Calculator!$D$2:$CM$2,0))","v":0.90150938135162406},null,null,null,null,null,19,"Propane",{"$f":"INDEX(P100:V100,0, MATCH($AB$1,$P$1:$V$1,0))","v":1.0876928978873526},null,"Propane",19,1.0876928978873526]
[null,null,null,null,null,null,null,null,null,null,null,null,null,20,"Propane",{"$f":"INDEX(Calculator!$D$6:$CM$36,MATCH($N101&P$2,Calculator!$A$6:$A$36,0),MATCH(P$1&$O101,Calculator!$D$2:$CM$2,0))","v":1.0528491335810979},{"$f":"INDEX(Calculator!$D$6:$CM$36,MATCH($N101&Q$2,Calculator!$A$6:$A$36,0),MATCH(Q$1&$O101,Calculator!$D$2:$CM$2,0))","v":1.0938155410553203},null,5,"Oil",{"$f":"INDEX(Calculator!$D$6:$CM$36,MATCH($S101&U$2,Calculator!$A$6:$A$36,0),MATCH(U$1&$T101,Calculator!$D$2:$CM$2,0))","v":0.86232679786134725},{"$f":"INDEX(Calculator!$D$6:$CM$36,MATCH($S101&V$2,Calculator!$A$6:$A$36,0),MATCH(V$1&$T101,Calculator!$D$2:$CM$2,0))","v":0.89521292996080726},null,null,null,null,null,20,"Propane",{"$f":"INDEX(P101:V101,0, MATCH($AB$1,$P$1:$V$1,0))","v":1.0938155410553203},null,"Propane",20,1.0938155410553203]
[null,null,null,null,null,null,null,null,null,null,null,null,null,21,"Propane",{"$f":"INDEX(Calculator!$D$6:$CM$36,MATCH($N102&P$2,Calculator!$A$6:$A$36,0),MATCH(P$1&$O102,Calculator!$D$2:$CM$2,0))","v":1.0543706834817048},{"$f":"INDEX(Calculator!$D$6:$CM$36,MATCH($N102&Q$2,Calculator!$A$6:$A$36,0),MATCH(Q$1&$O102,Calculator!$D$2:$CM$2,0))","v":1.0994325757570367},null,6,"Oil",{"$f":"INDEX(Calculator!$D$6:$CM$36,MATCH($S102&U$2,Calculator!$A$6:$A$36,0),MATCH(U$1&$T102,Calculator!$D$2:$CM$2,0))","v":0.86097861362888795},{"$f":"INDEX(Calculator!$D$6:$CM$36,MATCH($S102&V$2,Calculator!$A$6:$A$36,0),MATCH(V$1&$T102,Calculator!$D$2:$CM$2,0))","v":0.89651472833991153},null,null,null,null,null,21,"Propane",{"$f":"INDEX(P102:V102,0, MATCH($AB$1,$P$1:$V$1,0))","v":1.0994325757570367},null,"Propane",21,1.0994325757570367]
[null,null,null,null,null,null,null,null,null,null,null,null,null,22,"Propane",{"$f":"INDEX(Calculator!$D$6:$CM$36,MATCH($N103&P$2,Calculator!$A$6:$A$36,0),MATCH(P$1&$O103,Calculator!$D$2:$CM$2,0))","v":1.0573361850681946},{"$f":"INDEX(Calculator!$D$6:$CM$36,MATCH($N103&Q$2,Calculator!$A$6:$A$36,0),MATCH(Q$1&$O103,Calculator!$D$2:$CM$2,0))","v":1.1041964866176772},null,7,"Oil",{"$f":"INDEX(Calculator!$D$6:$CM$36,MATCH($S103&U$2,Calculator!$A$6:$A$36,0),MATCH(U$1&$T103,Calculator!$D$2:$CM$2,0))","v":0.86205559858561076},{"$f":"INDEX(Calculator!$D$6:$CM$36,MATCH($S103&V$2,Calculator!$A$6:$A$36,0),MATCH(V$1&$T103,Calculator!$D$2:$CM$2,0))","v":0.8999237981239363},null,null,null,null,null,22,"Propane",{"$f":"INDEX(P103:V103,0, MATCH($AB$1,$P$1:$V$1,0))","v":1.1041964866176772},null,"Propane",22,1.1041964866176772]
[null,null,null,null,null,null,null,null,null,null,null,null,null,23,"Propane",{"$f":"INDEX(Calculator!$D$6:$CM$36,MATCH($N104&P$2,Calculator!$A$6:$A$36,0),MATCH(P$1&$O104,Calculator!$D$2:$CM$2,0))","v":1.0849084190407647},{"$f":"INDEX(Calculator!$D$6:$CM$36,MATCH($N104&Q$2,Calculator!$A$6:$A$36,0),MATCH(Q$1&$O104,Calculator!$D$2:$CM$2,0))","v":1.1307843479014483},null,8,"Oil",{"$f":"INDEX(Calculator!$D$6:$CM$36,MATCH($S104&U$2,Calculator!$A$6:$A$36,0),MATCH(U$1&$T104,Calculator!$D$2:$CM$2,0))","v":0.86547726425671789},{"$f":"INDEX(Calculator!$D$6:$CM$36,MATCH($S104&V$2,Calculator!$A$6:$A$36,0),MATCH(V$1&$T104,Calculator!$D$2:$CM$2,0))","v":0.90537020148663738},null,null,null,null,null,23,"Propane",{"$f":"INDEX(P104:V104,0, MATCH($AB$1,$P$1:$V$1,0))","v":1.1307843479014483},null,"Propane",23,1.1307843479014483]
[null,null,null,null,null,null,null,null,null,null,null,null,null,24,"Propane",{"$f":"INDEX(Calculator!$D$6:$CM$36,MATCH($N105&P$2,Calculator!$A$6:$A$36,0),MATCH(P$1&$O105,Calculator!$D$2:$CM$2,0))","v":7.0755820982591091},{"$f":"INDEX(Calculator!$D$6:$CM$36,MATCH($N105&Q$2,Calculator!$A$6:$A$36,0),MATCH(Q$1&$O105,Calculator!$D$2:$CM$2,0))","v":7.4123542413854793},null,9,"Oil",{"$f":"INDEX(Calculator!$D$6:$CM$36,MATCH($S105&U$2,Calculator!$A$6:$A$36,0),MATCH(U$1&$T105,Calculator!$D$2:$CM$2,0))","v":0.86933002324909658},{"$f":"INDEX(Calculator!$D$6:$CM$36,MATCH($S105&V$2,Calculator!$A$6:$A$36,0),MATCH(V$1&$T105,Calculator!$D$2:$CM$2,0))","v":0.91119118928362042},null,null,null,null,null,24,"Propane",{"$f":"INDEX(P105:V105,0, MATCH($AB$1,$P$1:$V$1,0))","v":7.4123542413854793},null,"Propane",24,7.4123542413854793]
[null,null,null,null,null,null,null,null,null,null,null,null,null,25,"Propane",{"$f":"INDEX(Calculator!$D$6:$CM$36,MATCH($N106&P$2,Calculator!$A$6:$A$36,0),MATCH(P$1&$O106,Calculator!$D$2:$CM$2,0))","v":-5.0637793327503964},{"$f":"INDEX(Calculator!$D$6:$CM$36,MATCH($N106&Q$2,Calculator!$A$6:$A$36,0),MATCH(Q$1&$O106,Calculator!$D$2:$CM$2,0))","v":-5.313515908237024},null,10,"Oil",{"$f":"INDEX(Calculator!$D$6:$CM$36,MATCH($S106&U$2,Calculator!$A$6:$A$36,0),MATCH(U$1&$T106,Calculator!$D$2:$CM$2,0))","v":0.87135834742203488},{"$f":"INDEX(Calculator!$D$6:$CM$36,MATCH($S106&V$2,Calculator!$A$6:$A$36,0),MATCH(V$1&$T106,Calculator!$D$2:$CM$2,0))","v":0.91542689414764422},null,null,null,null,null,25,"Propane",{"$f":"INDEX(P106:V106,0, MATCH($AB$1,$P$1:$V$1,0))","v":-5.313515908237024},null,"Propane",25,-5.313515908237024]
[null,null,null,null,null,null,null,null,null,null,null,null,null,0,"Wood",{"$f":"INDEX(Calculator!$D$6:$CM$36,MATCH($N107&P$2,Calculator!$A$6:$A$36,0),MATCH(P$1&$O107,Calculator!$D$2:$CM$2,0))","v":1},{"$f":"INDEX(Calculator!$D$6:$CM$36,MATCH($N107&Q$2,Calculator!$A$6:$A$36,0),MATCH(Q$1&$O107,Calculator!$D$2:$CM$2,0))","v":1},null,11,"Oil",{"$f":"INDEX(Calculator!$D$6:$CM$36,MATCH($S107&U$2,Calculator!$A$6:$A$36,0),MATCH(U$1&$T107,Calculator!$D$2:$CM$2,0))","v":0.87396763122519694},{"$f":"INDEX(Calculator!$D$6:$CM$36,MATCH($S107&V$2,Calculator!$A$6:$A$36,0),MATCH(V$1&$T107,Calculator!$D$2:$CM$2,0))","v":0.92016740487084081},null,null,null,null,null,0,{"$f":"IF(OR($AB$1=\"FPI for v10\", $AB$1=\"FPI_SCC for v10\"), $T107, $O107)","v":"Wood"},{"$f":"INDEX(P107:V107,0, MATCH($AB$1,$P$1:$V$1,0))","v":1},null,"Wood",0,1]
[null,null,null,null,null,null,null,null,null,null,null,null,null,1,"Wood",{"$f":"INDEX(Calculator!$D$6:$CM$36,MATCH($N108&P$2,Calculator!$A$6:$A$36,0),MATCH(P$1&$O108,Calculator!$D$2:$CM$2,0))","v":1},{"$f":"INDEX(Calculator!$D$6:$CM$36,MATCH($N108&Q$2,Calculator!$A$6:$A$36,0),MATCH(Q$1&$O108,Calculator!$D$2:$CM$2,0))","v":1.0049806756849258},null,12,"Oil",{"$f":"INDEX(Calculator!$D$6:$CM$36,MATCH($S108&U$2,Calculator!$A$6:$A$36,0),MATCH(U$1&$T108,Calculator!$D$2:$CM$2,0))","v":0.87693841076462198},{"$f":"INDEX(Calculator!$D$6:$CM$36,MATCH($S108&V$2,Calculator!$A$6:$A$36,0),MATCH(V$1&$T108,Calculator!$D$2:$CM$2,0))","v":0.92522202548435994},null,null,null,null,null,{"$f":"IF(OR($AB$1=\"FPI for v10\", $AB$1=\"FPI_SCC for v10\"), $S108, $N108)","v":1},"Wood",{"$f":"INDEX(P108:V108,0, MATCH($AB$1,$P$1:$V$1,0))","v":1.0049806756849258},null,"Wood",1,1.0049806756849258]
[null,null,null,null,null,null,null,null,null,null,null,null,null,2,"Wood",{"$f":"INDEX(Calculator!$D$6:$CM$36,MATCH($N109&P$2,Calculator!$A$6:$A$36,0),MATCH(P$1&$O109,Calculator!$D$2:$CM$2,0))","v":1},{"$f":"INDEX(Calculator!$D$6:$CM$36,MATCH($N109&Q$2,Calculator!$A$6:$A$36,0),MATCH(Q$1&$O109,Calculator!$D$2:$CM$2,0))","v":1.0099613513698513},null,13,"Oil",{"$f":"INDEX(Calculator!$D$6:$CM$36,MATCH($S109&U$2,Calculator!$A$6:$A$36,0),MATCH(U$1&$T109,Calculator!$D$2:$CM$2,0))","v":0.87942932981491606},{"$f":"INDEX(Calculator!$D$6:$CM$36,MATCH($S109&V$2,Calculator!$A$6:$A$36,0),MATCH(V$1&$T109,Calculator!$D$2:$CM$2,0))","v":0.92985968702895816},null,null,null,null,null,2,"Wood",{"$f":"INDEX(P109:V109,0, MATCH($AB$1,$P$1:$V$1,0))","v":1.0099613513698513},null,"Wood",2,1.0099613513698513]
[null,null,null,null,null,null,null,null,null,null,null,null,null,3,"Wood",{"$f":"INDEX(Calculator!$D$6:$CM$36,MATCH($N110&P$2,Calculator!$A$6:$A$36,0),MATCH(P$1&$O110,Calculator!$D$2:$CM$2,0))","v":1},{"$f":"INDEX(Calculator!$D$6:$CM$36,MATCH($N110&Q$2,Calculator!$A$6:$A$36,0),MATCH(Q$1&$O110,Calculator!$D$2:$CM$2,0))","v":1.0149420270547771},null,14,"Oil",{"$f":"INDEX(Calculator!$D$6:$CM$36,MATCH($S110&U$2,Calculator!$A$6:$A$36,0),MATCH(U$1&$T110,Calculator!$D$2:$CM$2,0))","v":0.88183042675171408},{"$f":"INDEX(Calculator!$D$6:$CM$36,MATCH($S110&V$2,Calculator!$A$6:$A$36,0),MATCH(V$1&$T110,Calculator!$D$2:$CM$2,0))","v":0.93689255953688566},null,null,null,null,null,3,"Wood",{"$f":"INDEX(P110:V110,0, MATCH($AB$1,$P$1:$V$1,0))","v":1.0149420270547771},null,"Wood",3,1.0149420270547771]
[null,null,null,null,null,null,null,null,null,null,null,null,null,4,"Wood",{"$f":"INDEX(Calculator!$D$6:$CM$36,MATCH($N111&P$2,Calculator!$A$6:$A$36,0),MATCH(P$1&$O111,Calculator!$D$2:$CM$2,0))","v":1},{"$f":"INDEX(Calculator!$D$6:$CM$36,MATCH($N111&Q$2,Calculator!$A$6:$A$36,0),MATCH(Q$1&$O111,Calculator!$D$2:$CM$2,0))","v":1.0199227027397026},null,15,"Oil",{"$f":"INDEX(Calculator!$D$6:$CM$36,MATCH($S111&U$2,Calculator!$A$6:$A$36,0),MATCH(U$1&$T111,Calculator!$D$2:$CM$2,0))","v":0.88458739626402361},{"$f":"INDEX(Calculator!$D$6:$CM$36,MATCH($S111&V$2,Calculator!$A$6:$A$36,0),MATCH(V$1&$T111,Calculator!$D$2:$CM$2,0))","v":0.94176139692413108},null,null,null,null,null,4,"Wood",{"$f":"INDEX(P111:V111,0, MATCH($AB$1,$P$1:$V$1,0))","v":1.0199227027397026},null,"Wood",4,1.0199227027397026]
[null,null,null,null,null,null,null,null,null,null,null,null,null,5,"Wood",{"$f":"INDEX(Calculator!$D$6:$CM$36,MATCH($N112&P$2,Calculator!$A$6:$A$36,0),MATCH(P$1&$O112,Calculator!$D$2:$CM$2,0))","v":1},{"$f":"INDEX(Calculator!$D$6:$CM$36,MATCH($N112&Q$2,Calculator!$A$6:$A$36,0),MATCH(Q$1&$O112,Calculator!$D$2:$CM$2,0))","v":1.0298840541095542},null,16,"Oil",{"$f":"INDEX(Calculator!$D$6:$CM$36,MATCH($S112&U$2,Calculator!$A$6:$A$36,0),MATCH(U$1&$T112,Calculator!$D$2:$CM$2,0))","v":0.88667469890902706},{"$f":"INDEX(Calculator!$D$6:$CM$36,MATCH($S112&V$2,Calculator!$A$6:$A$36,0),MATCH(V$1&$T112,Calculator!$D$2:$CM$2,0))","v":0.94604834920142544},null,null,null,null,null,5,"Wood",{"$f":"INDEX(P112:V112,0, MATCH($AB$1,$P$1:$V$1,0))","v":1.0298840541095542},null,"Wood",5,1.0298840541095542]
[null,null,null,null,null,null,null,null,null,null,null,null,null,6,"Wood",{"$f":"INDEX(Calculator!$D$6:$CM$36,MATCH($N113&P$2,Calculator!$A$6:$A$36,0),MATCH(P$1&$O113,Calculator!$D$2:$CM$2,0))","v":1},{"$f":"INDEX(Calculator!$D$6:$CM$36,MATCH($N113&Q$2,Calculator!$A$6:$A$36,0),MATCH(Q$1&$O113,Calculator!$D$2:$CM$2,0))","v":1.03486472979448},null,17,"Oil",{"$f":"INDEX(Calculator!$D$6:$CM$36,MATCH($S113&U$2,Calculator!$A$6:$A$36,0),MATCH(U$1&$T113,Calculator!$D$2:$CM$2,0))","v":0.8889455339191682},{"$f":"INDEX(Calculator!$D$6:$CM$36,MATCH($S113&V$2,Calculator!$A$6:$A$36,0),MATCH(V$1&$T113,Calculator!$D$2:$CM$2,0))","v":0.95049477592143383},null,null,null,null,null,6,"Wood",{"$f":"INDEX(P113:V113,0, MATCH($AB$1,$P$1:$V$1,0))","v":1.03486472979448},null,"Wood",6,1.03486472979448]
[null,null,null,null,null,null,null,null,null,null,null,null,null,7,"Wood",{"$f":"INDEX(Calculator!$D$6:$CM$36,MATCH($N114&P$2,Calculator!$A$6:$A$36,0),MATCH(P$1&$O114,Calculator!$D$2:$CM$2,0))","v":1},{"$f":"INDEX(Calculator!$D$6:$CM$36,MATCH($N114&Q$2,Calculator!$A$6:$A$36,0),MATCH(Q$1&$O114,Calculator!$D$2:$CM$2,0))","v":1.0398454054794057},null,18,"Oil",{"$f":"INDEX(Calculator!$D$6:$CM$36,MATCH($S114&U$2,Calculator!$A$6:$A$36,0),MATCH(U$1&$T114,Calculator!$D$2:$CM$2,0))","v":0.89329553387332161},{"$f":"INDEX(Calculator!$D$6:$CM$36,MATCH($S114&V$2,Calculator!$A$6:$A$36,0),MATCH(V$1&$T114,Calculator!$D$2:$CM$2,0))","v":0.95674782498027733},null,null,null,null,null,7,"Wood",{"$f":"INDEX(P114:V114,0, MATCH($AB$1,$P$1:$V$1,0))","v":1.0398454054794057},null,"Wood",7,1.0398454054794057]
[null,null,null,null,null,null,null,null,null,null,null,null,null,8,"Wood",{"$f":"INDEX(Calculator!$D$6:$CM$36,MATCH($N115&P$2,Calculator!$A$6:$A$36,0),MATCH(P$1&$O115,Calculator!$D$2:$CM$2,0))","v":1},{"$f":"INDEX(Calculator!$D$6:$CM$36,MATCH($N115&Q$2,Calculator!$A$6:$A$36,0),MATCH(Q$1&$O115,Calculator!$D$2:$CM$2,0))","v":1.0448260811643313},null,19,"Oil",{"$f":"INDEX(Calculator!$D$6:$CM$36,MATCH($S115&U$2,Calculator!$A$6:$A$36,0),MATCH(U$1&$T115,Calculator!$D$2:$CM$2,0))","v":0.89486521688636955},{"$f":"INDEX(Calculator!$D$6:$CM$36,MATCH($S115&V$2,Calculator!$A$6:$A$36,0),MATCH(V$1&$T115,Calculator!$D$2:$CM$2,0))","v":0.9605850086171358},null,null,null,null,null,8,"Wood",{"$f":"INDEX(P115:V115,0, MATCH($AB$1,$P$1:$V$1,0))","v":1.0448260811643313},null,"Wood",8,1.0448260811643313]
[null,null,null,null,null,null,null,null,null,null,null,null,null,9,"Wood",{"$f":"INDEX(Calculator!$D$6:$CM$36,MATCH($N116&P$2,Calculator!$A$6:$A$36,0),MATCH(P$1&$O116,Calculator!$D$2:$CM$2,0))","v":1},{"$f":"INDEX(Calculator!$D$6:$CM$36,MATCH($N116&Q$2,Calculator!$A$6:$A$36,0),MATCH(Q$1&$O116,Calculator!$D$2:$CM$2,0))","v":1.0498067568492571},null,20,"Oil",{"$f":"INDEX(Calculator!$D$6:$CM$36,MATCH($S116&U$2,Calculator!$A$6:$A$36,0),MATCH(U$1&$T116,Calculator!$D$2:$CM$2,0))","v":0.89775335639638043},{"$f":"INDEX(Calculator!$D$6:$CM$36,MATCH($S116&V$2,Calculator!$A$6:$A$36,0),MATCH(V$1&$T116,Calculator!$D$2:$CM$2,0))","v":0.96556782188143453},null,null,null,null,null,9,"Wood",{"$f":"INDEX(P116:V116,0, MATCH($AB$1,$P$1:$V$1,0))","v":1.0498067568492571},null,"Wood",9,1.0498067568492571]
[null,null,null,null,null,null,null,null,null,null,null,null,null,10,"Wood",{"$f":"INDEX(Calculator!$D$6:$CM$36,MATCH($N117&P$2,Calculator!$A$6:$A$36,0),MATCH(P$1&$O117,Calculator!$D$2:$CM$2,0))","v":1},{"$f":"INDEX(Calculator!$D$6:$CM$36,MATCH($N117&Q$2,Calculator!$A$6:$A$36,0),MATCH(Q$1&$O117,Calculator!$D$2:$CM$2,0))","v":1.0547874325341828},null,21,"Oil",{"$f":"INDEX(Calculator!$D$6:$CM$36,MATCH($S117&U$2,Calculator!$A$6:$A$36,0),MATCH(U$1&$T117,Calculator!$D$2:$CM$2,0))","v":0.89710097763432051},{"$f":"INDEX(Calculator!$D$6:$CM$36,MATCH($S117&V$2,Calculator!$A$6:$A$36,0),MATCH(V$1&$T117,Calculator!$D$2:$CM$2,0))","v":0.96994747660376335},null,null,null,null,null,10,"Wood",{"$f":"INDEX(P117:V117,0, MATCH($AB$1,$P$1:$V$1,0))","v":1.0547874325341828},null,"Wood",10,1.0547874325341828]
[null,null,null,null,null,null,null,null,null,null,null,null,null,11,"Wood",{"$f":"INDEX(Calculator!$D$6:$CM$36,MATCH($N118&P$2,Calculator!$A$6:$A$36,0),MATCH(P$1&$O118,Calculator!$D$2:$CM$2,0))","v":1},{"$f":"INDEX(Calculator!$D$6:$CM$36,MATCH($N118&Q$2,Calculator!$A$6:$A$36,0),MATCH(Q$1&$O118,Calculator!$D$2:$CM$2,0))","v":1.0597681082191086},null,22,"Oil",{"$f":"INDEX(Calculator!$D$6:$CM$36,MATCH($S118&U$2,Calculator!$A$6:$A$36,0),MATCH(U$1&$T118,Calculator!$D$2:$CM$2,0))","v":0.8988804625100687},{"$f":"INDEX(Calculator!$D$6:$CM$36,MATCH($S118&V$2,Calculator!$A$6:$A$36,0),MATCH(V$1&$T118,Calculator!$D$2:$CM$2,0))","v":0.97396696070359146},null,null,null,null,null,11,"Wood",{"$f":"INDEX(P118:V118,0, MATCH($AB$1,$P$1:$V$1,0))","v":1.0597681082191086},null,"Wood",11,1.0597681082191086]
[null,null,null,null,null,null,null,null,null,null,null,null,null,12,"Wood",{"$f":"INDEX(Calculator!$D$6:$CM$36,MATCH($N119&P$2,Calculator!$A$6:$A$36,0),MATCH(P$1&$O119,Calculator!$D$2:$CM$2,0))","v":1},{"$f":"INDEX(Calculator!$D$6:$CM$36,MATCH($N119&Q$2,Calculator!$A$6:$A$36,0),MATCH(Q$1&$O119,Calculator!$D$2:$CM$2,0))","v":1.0647487839040344},null,23,"Oil",{"$f":"INDEX(Calculator!$D$6:$CM$36,MATCH($S119&U$2,Calculator!$A$6:$A$36,0),MATCH(U$1&$T119,Calculator!$D$2:$CM$2,0))","v":0.90764854615200052},{"$f":"INDEX(Calculator!$D$6:$CM$36,MATCH($S119&V$2,Calculator!$A$6:$A$36,0),MATCH(V$1&$T119,Calculator!$D$2:$CM$2,0))","v":0.98405895900413387},null,null,null,null,null,12,"Wood",{"$f":"INDEX(P119:V119,0, MATCH($AB$1,$P$1:$V$1,0))","v":1.0647487839040344},null,"Wood",12,1.0647487839040344]
[null,null,null,null,null,null,null,null,null,null,null,null,null,13,"Wood",{"$f":"INDEX(Calculator!$D$6:$CM$36,MATCH($N120&P$2,Calculator!$A$6:$A$36,0),MATCH(P$1&$O120,Calculator!$D$2:$CM$2,0))","v":1},{"$f":"INDEX(Calculator!$D$6:$CM$36,MATCH($N120&Q$2,Calculator!$A$6:$A$36,0),MATCH(Q$1&$O120,Calculator!$D$2:$CM$2,0))","v":1.0697294595889599},null,24,"Oil",{"$f":"INDEX(Calculator!$D$6:$CM$36,MATCH($S120&U$2,Calculator!$A$6:$A$36,0),MATCH(U$1&$T120,Calculator!$D$2:$CM$2,0))","v":0.9108789428130577},{"$f":"INDEX(Calculator!$D$6:$CM$36,MATCH($S120&V$2,Calculator!$A$6:$A$36,0),MATCH(V$1&$T120,Calculator!$D$2:$CM$2,0))","v":0.98933916541970057},null,null,null,null,null,13,"Wood",{"$f":"INDEX(P120:V120,0, MATCH($AB$1,$P$1:$V$1,0))","v":1.0697294595889599},null,"Wood",13,1.0697294595889599]
[null,null,null,null,null,null,null,null,null,null,null,null,null,14,"Wood",{"$f":"INDEX(Calculator!$D$6:$CM$36,MATCH($N121&P$2,Calculator!$A$6:$A$36,0),MATCH(P$1&$O121,Calculator!$D$2:$CM$2,0))","v":1},{"$f":"INDEX(Calculator!$D$6:$CM$36,MATCH($N121&Q$2,Calculator!$A$6:$A$36,0),MATCH(Q$1&$O121,Calculator!$D$2:$CM$2,0))","v":1.0796908109588113},null,25,"Oil",{"$f":"INDEX(Calculator!$D$6:$CM$36,MATCH($S121&U$2,Calculator!$A$6:$A$36,0),MATCH(U$1&$T121,Calculator!$D$2:$CM$2,0))","v":0.91189630607860472},{"$f":"INDEX(Calculator!$D$6:$CM$36,MATCH($S121&V$2,Calculator!$A$6:$A$36,0),MATCH(V$1&$T121,Calculator!$D$2:$CM$2,0))","v":0.99269642888625786},null,null,null,null,null,14,"Wood",{"$f":"INDEX(P121:V121,0, MATCH($AB$1,$P$1:$V$1,0))","v":1.0796908109588113},null,"Wood",14,1.0796908109588113]
[null,null,null,null,null,null,null,null,null,null,null,null,null,15,"Wood",{"$f":"INDEX(Calculator!$D$6:$CM$36,MATCH($N122&P$2,Calculator!$A$6:$A$36,0),MATCH(P$1&$O122,Calculator!$D$2:$CM$2,0))","v":1},{"$f":"INDEX(Calculator!$D$6:$CM$36,MATCH($N122&Q$2,Calculator!$A$6:$A$36,0),MATCH(Q$1&$O122,Calculator!$D$2:$CM$2,0))","v":1.084671486643737},null,26,"Oil",{"$f":"INDEX(Calculator!$D$6:$CM$36,MATCH($S122&U$2,Calculator!$A$6:$A$36,0),MATCH(U$1&$T122,Calculator!$D$2:$CM$2,0))","v":0.91371879862471594},{"$f":"INDEX(Calculator!$D$6:$CM$36,MATCH($S122&V$2,Calculator!$A$6:$A$36,0),MATCH(V$1&$T122,Calculator!$D$2:$CM$2,0))","v":0.99675328309385114},null,null,null,null,null,15,"Wood",{"$f":"INDEX(P122:V122,0, MATCH($AB$1,$P$1:$V$1,0))","v":1.084671486643737},null,"Wood",15,1.084671486643737]
[null,null,null,null,null,null,null,null,null,null,null,null,null,16,"Wood",{"$f":"INDEX(Calculator!$D$6:$CM$36,MATCH($N123&P$2,Calculator!$A$6:$A$36,0),MATCH(P$1&$O123,Calculator!$D$2:$CM$2,0))","v":1},{"$f":"INDEX(Calculator!$D$6:$CM$36,MATCH($N123&Q$2,Calculator!$A$6:$A$36,0),MATCH(Q$1&$O123,Calculator!$D$2:$CM$2,0))","v":1.0896521623286628},null,27,"Oil",{"$f":"INDEX(Calculator!$D$6:$CM$36,MATCH($S123&U$2,Calculator!$A$6:$A$36,0),MATCH(U$1&$T123,Calculator!$D$2:$CM$2,0))","v":0.91430025147387284},{"$f":"INDEX(Calculator!$D$6:$CM$36,MATCH($S123&V$2,Calculator!$A$6:$A$36,0),MATCH(V$1&$T123,Calculator!$D$2:$CM$2,0))","v":1.0022050354184431},null,null,null,null,null,16,"Wood",{"$f":"INDEX(P123:V123,0, MATCH($AB$1,$P$1:$V$1,0))","v":1.0896521623286628},null,"Wood",16,1.0896521623286628]
[null,null,null,null,null,null,null,null,null,null,null,null,null,17,"Wood",{"$f":"INDEX(Calculator!$D$6:$CM$36,MATCH($N124&P$2,Calculator!$A$6:$A$36,0),MATCH(P$1&$O124,Calculator!$D$2:$CM$2,0))","v":1},{"$f":"INDEX(Calculator!$D$6:$CM$36,MATCH($N124&Q$2,Calculator!$A$6:$A$36,0),MATCH(Q$1&$O124,Calculator!$D$2:$CM$2,0))","v":1.0946328380135886},null,28,"Oil",{"$f":"INDEX(Calculator!$D$6:$CM$36,MATCH($S124&U$2,Calculator!$A$6:$A$36,0),MATCH(U$1&$T124,Calculator!$D$2:$CM$2,0))","v":0.91655010305897155},{"$f":"INDEX(Calculator!$D$6:$CM$36,MATCH($S124&V$2,Calculator!$A$6:$A$36,0),MATCH(V$1&$T124,Calculator!$D$2:$CM$2,0))","v":1.0066332292779294},null,null,null,null,null,17,"Wood",{"$f":"INDEX(P124:V124,0, MATCH($AB$1,$P$1:$V$1,0))","v":1.0946328380135886},null,"Wood",17,1.0946328380135886]
[null,null,null,null,null,null,null,null,null,null,null,null,null,18,"Wood",{"$f":"INDEX(Calculator!$D$6:$CM$36,MATCH($N125&P$2,Calculator!$A$6:$A$36,0),MATCH(P$1&$O125,Calculator!$D$2:$CM$2,0))","v":1},{"$f":"INDEX(Calculator!$D$6:$CM$36,MATCH($N125&Q$2,Calculator!$A$6:$A$36,0),MATCH(Q$1&$O125,Calculator!$D$2:$CM$2,0))","v":1.0996135136985139},null,29,"Oil",{"$f":"INDEX(Calculator!$D$6:$CM$36,MATCH($S125&U$2,Calculator!$A$6:$A$36,0),MATCH(U$1&$T125,Calculator!$D$2:$CM$2,0))","v":0.9195289521830825},{"$f":"INDEX(Calculator!$D$6:$CM$36,MATCH($S125&V$2,Calculator!$A$6:$A$36,0),MATCH(V$1&$T125,Calculator!$D$2:$CM$2,0))","v":1.0092216027435057},null,null,null,null,null,18,"Wood",{"$f":"INDEX(P125:V125,0, MATCH($AB$1,$P$1:$V$1,0))","v":1.0996135136985139},null,"Wood",18,1.0996135136985139]
[null,null,null,null,null,null,null,null,null,null,null,null,null,19,"Wood",{"$f":"INDEX(Calculator!$D$6:$CM$36,MATCH($N126&P$2,Calculator!$A$6:$A$36,0),MATCH(P$1&$O126,Calculator!$D$2:$CM$2,0))","v":1},{"$f":"INDEX(Calculator!$D$6:$CM$36,MATCH($N126&Q$2,Calculator!$A$6:$A$36,0),MATCH(Q$1&$O126,Calculator!$D$2:$CM$2,0))","v":1.1045941893834397},null,30,"Oil",{"$f":"INDEX(Calculator!$D$6:$CM$36,MATCH($S126&U$2,Calculator!$A$6:$A$36,0),MATCH(U$1&$T126,Calculator!$D$2:$CM$2,0))","v":0.92251748276604073},{"$f":"INDEX(Calculator!$D$6:$CM$36,MATCH($S126&V$2,Calculator!$A$6:$A$36,0),MATCH(V$1&$T126,Calculator!$D$2:$CM$2,0))","v":1.011818388595928},null,null,null,null,null,19,"Wood",{"$f":"INDEX(P126:V126,0, MATCH($AB$1,$P$1:$V$1,0))","v":1.1045941893834397},null,"Wood",19,1.1045941893834397]
[null,null,null,null,null,null,null,null,null,null,null,null,null,20,"Wood",{"$f":"INDEX(Calculator!$D$6:$CM$36,MATCH($N127&P$2,Calculator!$A$6:$A$36,0),MATCH(P$1&$O127,Calculator!$D$2:$CM$2,0))","v":1},{"$f":"INDEX(Calculator!$D$6:$CM$36,MATCH($N127&Q$2,Calculator!$A$6:$A$36,0),MATCH(Q$1&$O127,Calculator!$D$2:$CM$2,0))","v":1.1095748650683654},null,0,"Kerosene",{"$f":"INDEX(Calculator!$D$6:$CM$36,MATCH($S127&U$2,Calculator!$A$6:$A$36,0),MATCH(U$1&$T127,Calculator!$D$2:$CM$2,0))","v":1},{"$f":"INDEX(Calculator!$D$6:$CM$36,MATCH($S127&V$2,Calculator!$A$6:$A$36,0),MATCH(V$1&$T127,Calculator!$D$2:$CM$2,0))","v":1},null,null,null,null,null,20,"Wood",{"$f":"INDEX(P127:V127,0, MATCH($AB$1,$P$1:$V$1,0))","v":1.1095748650683654},null,"Wood",20,1.1095748650683654]
[null,null,null,null,null,null,null,null,null,null,null,null,null,21,"Wood",{"$f":"INDEX(Calculator!$D$6:$CM$36,MATCH($N128&P$2,Calculator!$A$6:$A$36,0),MATCH(P$1&$O128,Calculator!$D$2:$CM$2,0))","v":1},{"$f":"INDEX(Calculator!$D$6:$CM$36,MATCH($N128&Q$2,Calculator!$A$6:$A$36,0),MATCH(Q$1&$O128,Calculator!$D$2:$CM$2,0))","v":1.119536216438217},null,1,"Kerosene",{"$f":"INDEX(Calculator!$D$6:$CM$36,MATCH($S128&U$2,Calculator!$A$6:$A$36,0),MATCH(U$1&$T128,Calculator!$D$2:$CM$2,0))","v":0.9596828259813811},{"$f":"INDEX(Calculator!$D$6:$CM$36,MATCH($S128&V$2,Calculator!$A$6:$A$36,0),MATCH(V$1&$T128,Calculator!$D$2:$CM$2,0))","v":0.96771386467472953},null,null,null,null,null,21,"Wood",{"$f":"INDEX(P128:V128,0, MATCH($AB$1,$P$1:$V$1,0))","v":1.119536216438217},null,"Wood",21,1.119536216438217]
[null,null,null,null,null,null,null,null,null,null,null,null,null,22,"Wood",{"$f":"INDEX(Calculator!$D$6:$CM$36,MATCH($N129&P$2,Calculator!$A$6:$A$36,0),MATCH(P$1&$O129,Calculator!$D$2:$CM$2,0))","v":1},{"$f":"INDEX(Calculator!$D$6:$CM$36,MATCH($N129&Q$2,Calculator!$A$6:$A$36,0),MATCH(Q$1&$O129,Calculator!$D$2:$CM$2,0))","v":1.1245168921231428},null,2,"Kerosene",{"$f":"INDEX(Calculator!$D$6:$CM$36,MATCH($S129&U$2,Calculator!$A$6:$A$36,0),MATCH(U$1&$T129,Calculator!$D$2:$CM$2,0))","v":0.91330895166801818},{"$f":"INDEX(Calculator!$D$6:$CM$36,MATCH($S129&V$2,Calculator!$A$6:$A$36,0),MATCH(V$1&$T129,Calculator!$D$2:$CM$2,0))","v":0.93019288448142434},null,null,null,null,null,22,"Wood",{"$f":"INDEX(P129:V129,0, MATCH($AB$1,$P$1:$V$1,0))","v":1.1245168921231428},null,"Wood",22,1.1245168921231428]
[null,null,null,null,null,null,null,null,null,null,null,null,null,23,"Wood",{"$f":"INDEX(Calculator!$D$6:$CM$36,MATCH($N130&P$2,Calculator!$A$6:$A$36,0),MATCH(P$1&$O130,Calculator!$D$2:$CM$2,0))","v":1},{"$f":"INDEX(Calculator!$D$6:$CM$36,MATCH($N130&Q$2,Calculator!$A$6:$A$36,0),MATCH(Q$1&$O130,Calculator!$D$2:$CM$2,0))","v":1.1294975678080683},null,3,"Kerosene",{"$f":"INDEX(Calculator!$D$6:$CM$36,MATCH($S130&U$2,Calculator!$A$6:$A$36,0),MATCH(U$1&$T130,Calculator!$D$2:$CM$2,0))","v":0.88964723820021419},{"$f":"INDEX(Calculator!$D$6:$CM$36,MATCH($S130&V$2,Calculator!$A$6:$A$36,0),MATCH(V$1&$T130,Calculator!$D$2:$CM$2,0))","v":0.91230217041628336},null,null,null,null,null,23,"Wood",{"$f":"INDEX(P130:V130,0, MATCH($AB$1,$P$1:$V$1,0))","v":1.1294975678080683},null,"Wood",23,1.1294975678080683]
[null,null,null,null,null,null,null,null,null,null,null,null,null,24,"Wood",{"$f":"INDEX(Calculator!$D$6:$CM$36,MATCH($N131&P$2,Calculator!$A$6:$A$36,0),MATCH(P$1&$O131,Calculator!$D$2:$CM$2,0))","v":6.4171914438781892},{"$f":"INDEX(Calculator!$D$6:$CM$36,MATCH($N131&Q$2,Calculator!$A$6:$A$36,0),MATCH(Q$1&$O131,Calculator!$D$2:$CM$2,0))","v":7.3770856987033842},null,4,"Kerosene",{"$f":"INDEX(Calculator!$D$6:$CM$36,MATCH($S131&U$2,Calculator!$A$6:$A$36,0),MATCH(U$1&$T131,Calculator!$D$2:$CM$2,0))","v":0.87526585386183964},{"$f":"INDEX(Calculator!$D$6:$CM$36,MATCH($S131&V$2,Calculator!$A$6:$A$36,0),MATCH(V$1&$T131,Calculator!$D$2:$CM$2,0))","v":0.9024325042737259},null,null,null,null,null,24,"Wood",{"$f":"INDEX(P131:V131,0, MATCH($AB$1,$P$1:$V$1,0))","v":7.3770856987033842},null,"Wood",24,7.3770856987033842]
[null,null,null,null,null,null,null,null,null,null,null,null,null,25,"Wood",{"$f":"INDEX(Calculator!$D$6:$CM$36,MATCH($N132&P$2,Calculator!$A$6:$A$36,0),MATCH(P$1&$O132,Calculator!$D$2:$CM$2,0))","v":-4.5797071871945407},{"$f":"INDEX(Calculator!$D$6:$CM$36,MATCH($N132&Q$2,Calculator!$A$6:$A$36,0),MATCH(Q$1&$O132,Calculator!$D$2:$CM$2,0))","v":-5.2904267596887777},null,5,"Kerosene",{"$f":"INDEX(Calculator!$D$6:$CM$36,MATCH($S132&U$2,Calculator!$A$6:$A$36,0),MATCH(U$1&$T132,Calculator!$D$2:$CM$2,0))","v":0.86232679786134725},{"$f":"INDEX(Calculator!$D$6:$CM$36,MATCH($S132&V$2,Calculator!$A$6:$A$36,0),MATCH(V$1&$T132,Calculator!$D$2:$CM$2,0))","v":0.89636970823202466},null,null,null,null,null,25,"Wood",{"$f":"INDEX(P132:V132,0, MATCH($AB$1,$P$1:$V$1,0))","v":-5.2904267596887777},null,{"$f":"AC132","v":"Wood"},{"$f":"AB132","v":25},-5.2904267596887777]
[null,null,null,null,null,null,null,null,null,null,null,null,null,0,"Coal",{"$f":"INDEX(Calculator!$D$6:$CM$36,MATCH($N133&P$2,Calculator!$A$6:$A$36,0),MATCH(P$1&$O133,Calculator!$D$2:$CM$2,0))","v":1},{"$f":"INDEX(Calculator!$D$6:$CM$36,MATCH($N133&Q$2,Calculator!$A$6:$A$36,0),MATCH(Q$1&$O133,Calculator!$D$2:$CM$2,0))","v":1},null,6,"Kerosene",{"$f":"INDEX(Calculator!$D$6:$CM$36,MATCH($S133&U$2,Calculator!$A$6:$A$36,0),MATCH(U$1&$T133,Calculator!$D$2:$CM$2,0))","v":0.86097861362888795},{"$f":"INDEX(Calculator!$D$6:$CM$36,MATCH($S133&V$2,Calculator!$A$6:$A$36,0),MATCH(V$1&$T133,Calculator!$D$2:$CM$2,0))","v":0.8977647204404382},null,null,null,null,null,0,"Coal",{"$f":"INDEX(P133:V133,0, MATCH($AB$1,$P$1:$V$1,0))","v":1},null,"Coal",0,1]
[null,null,null,null,null,null,null,null,null,null,null,null,null,1,"Coal",{"$f":"INDEX(Calculator!$D$6:$CM$36,MATCH($N134&P$2,Calculator!$A$6:$A$36,0),MATCH(P$1&$O134,Calculator!$D$2:$CM$2,0))","v":0.99958037539727507},{"$f":"INDEX(Calculator!$D$6:$CM$36,MATCH($N134&Q$2,Calculator!$A$6:$A$36,0),MATCH(Q$1&$O134,Calculator!$D$2:$CM$2,0))","v":0.99958037539727507},null,7,"Kerosene",{"$f":"INDEX(Calculator!$D$6:$CM$36,MATCH($S134&U$2,Calculator!$A$6:$A$36,0),MATCH(U$1&$T134,Calculator!$D$2:$CM$2,0))","v":0.86205559858561076},{"$f":"INDEX(Calculator!$D$6:$CM$36,MATCH($S134&V$2,Calculator!$A$6:$A$36,0),MATCH(V$1&$T134,Calculator!$D$2:$CM$2,0))","v":0.90125582191632325},null,null,null,null,null,1,"Coal",{"$f":"INDEX(P134:V134,0, MATCH($AB$1,$P$1:$V$1,0))","v":0.99958037539727507},null,"Coal",1,0.99958037539727507]
[null,null,null,null,null,null,null,null,null,null,null,null,null,2,"Coal",{"$f":"INDEX(Calculator!$D$6:$CM$36,MATCH($N135&P$2,Calculator!$A$6:$A$36,0),MATCH(P$1&$O135,Calculator!$D$2:$CM$2,0))","v":1.0154324603239135},{"$f":"INDEX(Calculator!$D$6:$CM$36,MATCH($N135&Q$2,Calculator!$A$6:$A$36,0),MATCH(Q$1&$O135,Calculator!$D$2:$CM$2,0))","v":1.0154324603239135},null,8,"Kerosene",{"$f":"INDEX(Calculator!$D$6:$CM$36,MATCH($S135&U$2,Calculator!$A$6:$A$36,0),MATCH(U$1&$T135,Calculator!$D$2:$CM$2,0))","v":0.86547726425671789},{"$f":"INDEX(Calculator!$D$6:$CM$36,MATCH($S135&V$2,Calculator!$A$6:$A$36,0),MATCH(V$1&$T135,Calculator!$D$2:$CM$2,0))","v":0.90677344595524934},null,null,null,null,null,2,"Coal",{"$f":"INDEX(P135:V135,0, MATCH($AB$1,$P$1:$V$1,0))","v":1.0154324603239135},null,"Coal",2,1.0154324603239135]
[null,null,null,null,null,null,null,null,null,null,null,null,null,3,"Coal",{"$f":"INDEX(Calculator!$D$6:$CM$36,MATCH($N136&P$2,Calculator!$A$6:$A$36,0),MATCH(P$1&$O136,Calculator!$D$2:$CM$2,0))","v":1.0230917597032092},{"$f":"INDEX(Calculator!$D$6:$CM$36,MATCH($N136&Q$2,Calculator!$A$6:$A$36,0),MATCH(Q$1&$O136,Calculator!$D$2:$CM$2,0))","v":1.0230917597032092},null,9,"Kerosene",{"$f":"INDEX(Calculator!$D$6:$CM$36,MATCH($S136&U$2,Calculator!$A$6:$A$36,0),MATCH(U$1&$T136,Calculator!$D$2:$CM$2,0))","v":0.86933002324909658},{"$f":"INDEX(Calculator!$D$6:$CM$36,MATCH($S136&V$2,Calculator!$A$6:$A$36,0),MATCH(V$1&$T136,Calculator!$D$2:$CM$2,0))","v":0.91266366671362364},null,null,null,null,null,3,"Coal",{"$f":"INDEX(P136:V136,0, MATCH($AB$1,$P$1:$V$1,0))","v":1.0230917597032092},null,"Coal",3,1.0230917597032092]
[null,null,null,null,null,null,null,null,null,null,null,null,null,4,"Coal",{"$f":"INDEX(Calculator!$D$6:$CM$36,MATCH($N137&P$2,Calculator!$A$6:$A$36,0),MATCH(P$1&$O137,Calculator!$D$2:$CM$2,0))","v":1.0199693294193084},{"$f":"INDEX(Calculator!$D$6:$CM$36,MATCH($N137&Q$2,Calculator!$A$6:$A$36,0),MATCH(Q$1&$O137,Calculator!$D$2:$CM$2,0))","v":1.0199693294193084},null,10,"Kerosene",{"$f":"INDEX(Calculator!$D$6:$CM$36,MATCH($S137&U$2,Calculator!$A$6:$A$36,0),MATCH(U$1&$T137,Calculator!$D$2:$CM$2,0))","v":0.87135834742203488},{"$f":"INDEX(Calculator!$D$6:$CM$36,MATCH($S137&V$2,Calculator!$A$6:$A$36,0),MATCH(V$1&$T137,Calculator!$D$2:$CM$2,0))","v":0.91697701676900156},null,null,null,null,null,4,"Coal",{"$f":"INDEX(P137:V137,0, MATCH($AB$1,$P$1:$V$1,0))","v":1.0199693294193084},null,"Coal",4,1.0199693294193084]
[null,null,null,null,null,null,null,null,null,null,null,null,null,5,"Coal",{"$f":"INDEX(Calculator!$D$6:$CM$36,MATCH($N138&P$2,Calculator!$A$6:$A$36,0),MATCH(P$1&$O138,Calculator!$D$2:$CM$2,0))","v":1.0125766577111781},{"$f":"INDEX(Calculator!$D$6:$CM$36,MATCH($N138&Q$2,Calculator!$A$6:$A$36,0),MATCH(Q$1&$O138,Calculator!$D$2:$CM$2,0))","v":1.0125766577111781},null,11,"Kerosene",{"$f":"INDEX(Calculator!$D$6:$CM$36,MATCH($S138&U$2,Calculator!$A$6:$A$36,0),MATCH(U$1&$T138,Calculator!$D$2:$CM$2,0))","v":0.87396763122519694},{"$f":"INDEX(Calculator!$D$6:$CM$36,MATCH($S138&V$2,Calculator!$A$6:$A$36,0),MATCH(V$1&$T138,Calculator!$D$2:$CM$2,0))","v":0.92179249395479912},null,null,null,null,null,5,"Coal",{"$f":"INDEX(P138:V138,0, MATCH($AB$1,$P$1:$V$1,0))","v":1.0125766577111781},null,"Coal",5,1.0125766577111781]
[null,null,null,null,null,null,null,null,null,null,null,null,null,6,"Coal",{"$f":"INDEX(Calculator!$D$6:$CM$36,MATCH($N139&P$2,Calculator!$A$6:$A$36,0),MATCH(P$1&$O139,Calculator!$D$2:$CM$2,0))","v":1.0072756330471637},{"$f":"INDEX(Calculator!$D$6:$CM$36,MATCH($N139&Q$2,Calculator!$A$6:$A$36,0),MATCH(Q$1&$O139,Calculator!$D$2:$CM$2,0))","v":1.0072756330471637},null,12,"Kerosene",{"$f":"INDEX(Calculator!$D$6:$CM$36,MATCH($S139&U$2,Calculator!$A$6:$A$36,0),MATCH(U$1&$T139,Calculator!$D$2:$CM$2,0))","v":0.87693841076462198},{"$f":"INDEX(Calculator!$D$6:$CM$36,MATCH($S139&V$2,Calculator!$A$6:$A$36,0),MATCH(V$1&$T139,Calculator!$D$2:$CM$2,0))","v":0.92692041422143312},null,null,null,null,null,6,"Coal",{"$f":"INDEX(P139:V139,0, MATCH($AB$1,$P$1:$V$1,0))","v":1.0072756330471637},null,"Coal",6,{"$f":"AD139","v":1.0072756330471637}]
[null,null,null,null,null,null,null,null,null,null,null,null,null,7,"Coal",{"$f":"INDEX(Calculator!$D$6:$CM$36,MATCH($N140&P$2,Calculator!$A$6:$A$36,0),MATCH(P$1&$O140,Calculator!$D$2:$CM$2,0))","v":1.0031508877058128},{"$f":"INDEX(Calculator!$D$6:$CM$36,MATCH($N140&Q$2,Calculator!$A$6:$A$36,0),MATCH(Q$1&$O140,Calculator!$D$2:$CM$2,0))","v":1.0031508877058128},null,13,"Kerosene",{"$f":"INDEX(Calculator!$D$6:$CM$36,MATCH($S140&U$2,Calculator!$A$6:$A$36,0),MATCH(U$1&$T140,Calculator!$D$2:$CM$2,0))","v":0.87942932981491606},{"$f":"INDEX(Calculator!$D$6:$CM$36,MATCH($S140&V$2,Calculator!$A$6:$A$36,0),MATCH(V$1&$T140,Calculator!$D$2:$CM$2,0))","v":0.931633587993003},null,null,null,null,null,7,"Coal",{"$f":"INDEX(P140:V140,0, MATCH($AB$1,$P$1:$V$1,0))","v":1.0031508877058128},null,"Coal",7,1.0031508877058128]
[null,null,null,null,null,null,null,null,null,null,null,null,null,8,"Coal",{"$f":"INDEX(Calculator!$D$6:$CM$36,MATCH($N141&P$2,Calculator!$A$6:$A$36,0),MATCH(P$1&$O141,Calculator!$D$2:$CM$2,0))","v":0.998864722589065},{"$f":"INDEX(Calculator!$D$6:$CM$36,MATCH($N141&Q$2,Calculator!$A$6:$A$36,0),MATCH(Q$1&$O141,Calculator!$D$2:$CM$2,0))","v":0.998864722589065},null,14,"Kerosene",{"$f":"INDEX(Calculator!$D$6:$CM$36,MATCH($S141&U$2,Calculator!$A$6:$A$36,0),MATCH(U$1&$T141,Calculator!$D$2:$CM$2,0))","v":0.88183042675171408},{"$f":"INDEX(Calculator!$D$6:$CM$36,MATCH($S141&V$2,Calculator!$A$6:$A$36,0),MATCH(V$1&$T141,Calculator!$D$2:$CM$2,0))","v":0.93882938441431851},null,null,null,null,null,8,"Coal",{"$f":"INDEX(P141:V141,0, MATCH($AB$1,$P$1:$V$1,0))","v":0.998864722589065},null,"Coal",8,0.998864722589065]
[null,null,null,null,null,null,null,null,null,null,null,null,null,9,"Coal",{"$f":"INDEX(Calculator!$D$6:$CM$36,MATCH($N142&P$2,Calculator!$A$6:$A$36,0),MATCH(P$1&$O142,Calculator!$D$2:$CM$2,0))","v":0.99395382073894578},{"$f":"INDEX(Calculator!$D$6:$CM$36,MATCH($N142&Q$2,Calculator!$A$6:$A$36,0),MATCH(Q$1&$O142,Calculator!$D$2:$CM$2,0))","v":0.99395382073894578},null,15,"Kerosene",{"$f":"INDEX(Calculator!$D$6:$CM$36,MATCH($S142&U$2,Calculator!$A$6:$A$36,0),MATCH(U$1&$T142,Calculator!$D$2:$CM$2,0))","v":0.88458739626402361},{"$f":"INDEX(Calculator!$D$6:$CM$36,MATCH($S142&V$2,Calculator!$A$6:$A$36,0),MATCH(V$1&$T142,Calculator!$D$2:$CM$2,0))","v":0.94377250730470608},null,null,null,null,null,9,"Coal",{"$f":"INDEX(P142:V142,0, MATCH($AB$1,$P$1:$V$1,0))","v":0.99395382073894578},null,"Coal",9,0.99395382073894578]
[null,null,null,null,null,null,null,null,null,null,null,null,null,10,"Coal",{"$f":"INDEX(Calculator!$D$6:$CM$36,MATCH($N143&P$2,Calculator!$A$6:$A$36,0),MATCH(P$1&$O143,Calculator!$D$2:$CM$2,0))","v":0.98999259627037806},{"$f":"INDEX(Calculator!$D$6:$CM$36,MATCH($N143&Q$2,Calculator!$A$6:$A$36,0),MATCH(Q$1&$O143,Calculator!$D$2:$CM$2,0))","v":0.98999259627037806},null,16,"Kerosene",{"$f":"INDEX(Calculator!$D$6:$CM$36,MATCH($S143&U$2,Calculator!$A$6:$A$36,0),MATCH(U$1&$T143,Calculator!$D$2:$CM$2,0))","v":0.88667469890902706},{"$f":"INDEX(Calculator!$D$6:$CM$36,MATCH($S143&V$2,Calculator!$A$6:$A$36,0),MATCH(V$1&$T143,Calculator!$D$2:$CM$2,0))","v":0.94813683283134542},null,null,null,null,null,10,"Coal",{"$f":"INDEX(P143:V143,0, MATCH($AB$1,$P$1:$V$1,0))","v":0.98999259627037806},null,"Coal",10,0.98999259627037806]
[null,null,null,null,null,null,null,null,null,null,null,null,null,11,"Coal",{"$f":"INDEX(Calculator!$D$6:$CM$36,MATCH($N144&P$2,Calculator!$A$6:$A$36,0),MATCH(P$1&$O144,Calculator!$D$2:$CM$2,0))","v":0.98754377488635114},{"$f":"INDEX(Calculator!$D$6:$CM$36,MATCH($N144&Q$2,Calculator!$A$6:$A$36,0),MATCH(Q$1&$O144,Calculator!$D$2:$CM$2,0))","v":0.98754377488635114},null,17,"Kerosene",{"$f":"INDEX(Calculator!$D$6:$CM$36,MATCH($S144&U$2,Calculator!$A$6:$A$36,0),MATCH(U$1&$T144,Calculator!$D$2:$CM$2,0))","v":0.8889455339191682},{"$f":"INDEX(Calculator!$D$6:$CM$36,MATCH($S144&V$2,Calculator!$A$6:$A$36,0),MATCH(V$1&$T144,Calculator!$D$2:$CM$2,0))","v":0.95265978655700501},null,null,null,null,null,11,"Coal",{"$f":"INDEX(P144:V144,0, MATCH($AB$1,$P$1:$V$1,0))","v":0.98754377488635114},null,"Coal",11,0.98754377488635114]
[null,null,null,null,null,null,null,null,null,null,null,null,null,12,"Coal",{"$f":"INDEX(Calculator!$D$6:$CM$36,MATCH($N145&P$2,Calculator!$A$6:$A$36,0),MATCH(P$1&$O145,Calculator!$D$2:$CM$2,0))","v":0.98550263565661222},{"$f":"INDEX(Calculator!$D$6:$CM$36,MATCH($N145&Q$2,Calculator!$A$6:$A$36,0),MATCH(Q$1&$O145,Calculator!$D$2:$CM$2,0))","v":0.98550263565661234},null,18,"Kerosene",{"$f":"INDEX(Calculator!$D$6:$CM$36,MATCH($S145&U$2,Calculator!$A$6:$A$36,0),MATCH(U$1&$T145,Calculator!$D$2:$CM$2,0))","v":0.89329553387332161},{"$f":"INDEX(Calculator!$D$6:$CM$36,MATCH($S145&V$2,Calculator!$A$6:$A$36,0),MATCH(V$1&$T145,Calculator!$D$2:$CM$2,0))","v":0.95897977586430039},null,null,null,null,null,12,"Coal",{"$f":"INDEX(P145:V145,0, MATCH($AB$1,$P$1:$V$1,0))","v":0.98550263565661234},null,"Coal",12,0.98550263565661234]
[null,null,null,null,null,null,null,null,null,null,null,null,null,13,"Coal",{"$f":"INDEX(Calculator!$D$6:$CM$36,MATCH($N146&P$2,Calculator!$A$6:$A$36,0),MATCH(P$1&$O146,Calculator!$D$2:$CM$2,0))","v":0.983826355068257},{"$f":"INDEX(Calculator!$D$6:$CM$36,MATCH($N146&Q$2,Calculator!$A$6:$A$36,0),MATCH(Q$1&$O146,Calculator!$D$2:$CM$2,0))","v":0.983826355068257},null,19,"Kerosene",{"$f":"INDEX(Calculator!$D$6:$CM$36,MATCH($S146&U$2,Calculator!$A$6:$A$36,0),MATCH(U$1&$T146,Calculator!$D$2:$CM$2,0))","v":0.89486521688636955},{"$f":"INDEX(Calculator!$D$6:$CM$36,MATCH($S146&V$2,Calculator!$A$6:$A$36,0),MATCH(V$1&$T146,Calculator!$D$2:$CM$2,0))","v":0.96289671942682198},null,null,null,null,null,13,"Coal",{"$f":"INDEX(P146:V146,0, MATCH($AB$1,$P$1:$V$1,0))","v":0.983826355068257},null,"Coal",13,0.983826355068257]
[null,null,null,null,null,null,null,null,null,null,null,null,null,14,"Coal",{"$f":"INDEX(Calculator!$D$6:$CM$36,MATCH($N147&P$2,Calculator!$A$6:$A$36,0),MATCH(P$1&$O147,Calculator!$D$2:$CM$2,0))","v":0.98293976559455631},{"$f":"INDEX(Calculator!$D$6:$CM$36,MATCH($N147&Q$2,Calculator!$A$6:$A$36,0),MATCH(Q$1&$O147,Calculator!$D$2:$CM$2,0))","v":0.98293976559455631},null,20,"Kerosene",{"$f":"INDEX(Calculator!$D$6:$CM$36,MATCH($S147&U$2,Calculator!$A$6:$A$36,0),MATCH(U$1&$T147,Calculator!$D$2:$CM$2,0))","v":0.89775335639638043},{"$f":"INDEX(Calculator!$D$6:$CM$36,MATCH($S147&V$2,Calculator!$A$6:$A$36,0),MATCH(V$1&$T147,Calculator!$D$2:$CM$2,0))","v":0.96795321338658591},null,null,null,null,null,14,"Coal",{"$f":"INDEX(P147:V147,0, MATCH($AB$1,$P$1:$V$1,0))","v":0.98293976559455631},null,"Coal",14,0.98293976559455631]
[null,null,null,null,null,null,null,null,null,null,null,null,null,15,"Coal",{"$f":"INDEX(Calculator!$D$6:$CM$36,MATCH($N148&P$2,Calculator!$A$6:$A$36,0),MATCH(P$1&$O148,Calculator!$D$2:$CM$2,0))","v":0.98280573923407222},{"$f":"INDEX(Calculator!$D$6:$CM$36,MATCH($N148&Q$2,Calculator!$A$6:$A$36,0),MATCH(Q$1&$O148,Calculator!$D$2:$CM$2,0))","v":0.98280573923407222},null,21,"Kerosene",{"$f":"INDEX(Calculator!$D$6:$CM$36,MATCH($S148&U$2,Calculator!$A$6:$A$36,0),MATCH(U$1&$T148,Calculator!$D$2:$CM$2,0))","v":0.89710097763432051},{"$f":"INDEX(Calculator!$D$6:$CM$36,MATCH($S148&V$2,Calculator!$A$6:$A$36,0),MATCH(V$1&$T148,Calculator!$D$2:$CM$2,0))","v":0.97250987119876353},null,null,null,null,null,15,"Coal",{"$f":"INDEX(P148:V148,0, MATCH($AB$1,$P$1:$V$1,0))","v":0.98280573923407222},null,"Coal",15,0.98280573923407222]
[null,null,null,null,null,null,null,null,null,null,null,null,null,16,"Coal",{"$f":"INDEX(Calculator!$D$6:$CM$36,MATCH($N149&P$2,Calculator!$A$6:$A$36,0),MATCH(P$1&$O149,Calculator!$D$2:$CM$2,0))","v":0.98242345287969679},{"$f":"INDEX(Calculator!$D$6:$CM$36,MATCH($N149&Q$2,Calculator!$A$6:$A$36,0),MATCH(Q$1&$O149,Calculator!$D$2:$CM$2,0))","v":0.98242345287969679},null,22,"Kerosene",{"$f":"INDEX(Calculator!$D$6:$CM$36,MATCH($S149&U$2,Calculator!$A$6:$A$36,0),MATCH(U$1&$T149,Calculator!$D$2:$CM$2,0))","v":0.8988804625100687},{"$f":"INDEX(Calculator!$D$6:$CM$36,MATCH($S149&V$2,Calculator!$A$6:$A$36,0),MATCH(V$1&$T149,Calculator!$D$2:$CM$2,0))","v":0.97660814785534833},null,null,null,null,null,16,"Coal",{"$f":"INDEX(P149:V149,0, MATCH($AB$1,$P$1:$V$1,0))","v":0.98242345287969679},null,"Coal",16,0.98242345287969679]
[null,null,null,null,null,null,null,null,null,null,null,null,null,17,"Coal",{"$f":"INDEX(Calculator!$D$6:$CM$36,MATCH($N150&P$2,Calculator!$A$6:$A$36,0),MATCH(P$1&$O150,Calculator!$D$2:$CM$2,0))","v":0.98069830369882582},{"$f":"INDEX(Calculator!$D$6:$CM$36,MATCH($N150&Q$2,Calculator!$A$6:$A$36,0),MATCH(Q$1&$O150,Calculator!$D$2:$CM$2,0))","v":0.98069830369882582},null,23,"Kerosene",{"$f":"INDEX(Calculator!$D$6:$CM$36,MATCH($S150&U$2,Calculator!$A$6:$A$36,0),MATCH(U$1&$T150,Calculator!$D$2:$CM$2,0))","v":0.90764854615200052},{"$f":"INDEX(Calculator!$D$6:$CM$36,MATCH($S150&V$2,Calculator!$A$6:$A$36,0),MATCH(V$1&$T150,Calculator!$D$2:$CM$2,0))","v":0.98674671519920054},null,null,null,null,null,17,"Coal",{"$f":"INDEX(P150:V150,0, MATCH($AB$1,$P$1:$V$1,0))","v":0.98069830369882582},null,"Coal",17,0.98069830369882582]
[null,null,null,null,null,null,null,null,null,null,null,null,null,18,"Coal",{"$f":"INDEX(Calculator!$D$6:$CM$36,MATCH($N151&P$2,Calculator!$A$6:$A$36,0),MATCH(P$1&$O151,Calculator!$D$2:$CM$2,0))","v":0.97898990127258756},{"$f":"INDEX(Calculator!$D$6:$CM$36,MATCH($N151&Q$2,Calculator!$A$6:$A$36,0),MATCH(Q$1&$O151,Calculator!$D$2:$CM$2,0))","v":0.97898990127258756},null,24,"Kerosene",{"$f":"INDEX(Calculator!$D$6:$CM$36,MATCH($S151&U$2,Calculator!$A$6:$A$36,0),MATCH(U$1&$T151,Calculator!$D$2:$CM$2,0))","v":0.9108789428130577},{"$f":"INDEX(Calculator!$D$6:$CM$36,MATCH($S151&V$2,Calculator!$A$6:$A$36,0),MATCH(V$1&$T151,Calculator!$D$2:$CM$2,0))","v":0.99209902420734275},null,null,null,null,null,18,"Coal",{"$f":"INDEX(P151:V151,0, MATCH($AB$1,$P$1:$V$1,0))","v":0.97898990127258756},null,"Coal",18,0.97898990127258756]
[null,null,null,null,null,null,null,null,null,null,null,null,null,19,"Coal",{"$f":"INDEX(Calculator!$D$6:$CM$36,MATCH($N152&P$2,Calculator!$A$6:$A$36,0),MATCH(P$1&$O152,Calculator!$D$2:$CM$2,0))","v":0.97734247820694897},{"$f":"INDEX(Calculator!$D$6:$CM$36,MATCH($N152&Q$2,Calculator!$A$6:$A$36,0),MATCH(Q$1&$O152,Calculator!$D$2:$CM$2,0))","v":0.97734247820694897},null,25,"Kerosene",{"$f":"INDEX(Calculator!$D$6:$CM$36,MATCH($S152&U$2,Calculator!$A$6:$A$36,0),MATCH(U$1&$T152,Calculator!$D$2:$CM$2,0))","v":0.91189630607860472},{"$f":"INDEX(Calculator!$D$6:$CM$36,MATCH($S152&V$2,Calculator!$A$6:$A$36,0),MATCH(V$1&$T152,Calculator!$D$2:$CM$2,0))","v":0.99553859427356817},null,null,null,null,null,19,"Coal",{"$f":"INDEX(P152:V152,0, MATCH($AB$1,$P$1:$V$1,0))","v":0.97734247820694897},null,"Coal",19,0.97734247820694897]
[null,null,null,null,null,null,null,null,null,null,null,null,null,20,"Coal",{"$f":"INDEX(Calculator!$D$6:$CM$36,MATCH($N153&P$2,Calculator!$A$6:$A$36,0),MATCH(P$1&$O153,Calculator!$D$2:$CM$2,0))","v":0.97725979661604001},{"$f":"INDEX(Calculator!$D$6:$CM$36,MATCH($N153&Q$2,Calculator!$A$6:$A$36,0),MATCH(Q$1&$O153,Calculator!$D$2:$CM$2,0))","v":0.97725979661604012},null,26,"Kerosene",{"$f":"INDEX(Calculator!$D$6:$CM$36,MATCH($S153&U$2,Calculator!$A$6:$A$36,0),MATCH(U$1&$T153,Calculator!$D$2:$CM$2,0))","v":0.91371879862471594},{"$f":"INDEX(Calculator!$D$6:$CM$36,MATCH($S153&V$2,Calculator!$A$6:$A$36,0),MATCH(V$1&$T153,Calculator!$D$2:$CM$2,0))","v":0.99967404273518368},null,null,null,null,null,20,"Coal",{"$f":"INDEX(P153:V153,0, MATCH($AB$1,$P$1:$V$1,0))","v":0.97725979661604012},null,"Coal",20,0.97725979661604012]
[null,null,null,null,null,null,null,null,null,null,null,null,null,21,"Coal",{"$f":"INDEX(Calculator!$D$6:$CM$36,MATCH($N154&P$2,Calculator!$A$6:$A$36,0),MATCH(P$1&$O154,Calculator!$D$2:$CM$2,0))","v":0.97796753592336461},{"$f":"INDEX(Calculator!$D$6:$CM$36,MATCH($N154&Q$2,Calculator!$A$6:$A$36,0),MATCH(Q$1&$O154,Calculator!$D$2:$CM$2,0))","v":0.97796753592336461},null,27,"Kerosene",{"$f":"INDEX(Calculator!$D$6:$CM$36,MATCH($S154&U$2,Calculator!$A$6:$A$36,0),MATCH(U$1&$T154,Calculator!$D$2:$CM$2,0))","v":0.91430025147387284},{"$f":"INDEX(Calculator!$D$6:$CM$36,MATCH($S154&V$2,Calculator!$A$6:$A$36,0),MATCH(V$1&$T154,Calculator!$D$2:$CM$2,0))","v":1.0052971091136895},null,null,null,null,null,21,"Coal",{"$f":"INDEX(P154:V154,0, MATCH($AB$1,$P$1:$V$1,0))","v":0.97796753592336461},null,"Coal",21,0.97796753592336461]
[null,null,null,null,null,null,null,null,null,null,null,null,null,22,"Coal",{"$f":"INDEX(Calculator!$D$6:$CM$36,MATCH($N155&P$2,Calculator!$A$6:$A$36,0),MATCH(P$1&$O155,Calculator!$D$2:$CM$2,0))","v":0.97985988033346649},{"$f":"INDEX(Calculator!$D$6:$CM$36,MATCH($N155&Q$2,Calculator!$A$6:$A$36,0),MATCH(Q$1&$O155,Calculator!$D$2:$CM$2,0))","v":0.97985988033346649},null,28,"Kerosene",{"$f":"INDEX(Calculator!$D$6:$CM$36,MATCH($S155&U$2,Calculator!$A$6:$A$36,0),MATCH(U$1&$T155,Calculator!$D$2:$CM$2,0))","v":0.91655010305897155},{"$f":"INDEX(Calculator!$D$6:$CM$36,MATCH($S155&V$2,Calculator!$A$6:$A$36,0),MATCH(V$1&$T155,Calculator!$D$2:$CM$2,0))","v":1.0098019267306508},null,null,null,null,null,22,"Coal",{"$f":"INDEX(P155:V155,0, MATCH($AB$1,$P$1:$V$1,0))","v":0.97985988033346649},null,"Coal",22,0.97985988033346649]
[null,null,null,null,null,null,null,null,null,null,null,null,null,23,"Coal",{"$f":"INDEX(Calculator!$D$6:$CM$36,MATCH($N156&P$2,Calculator!$A$6:$A$36,0),MATCH(P$1&$O156,Calculator!$D$2:$CM$2,0))","v":0.9801098274443335},{"$f":"INDEX(Calculator!$D$6:$CM$36,MATCH($N156&Q$2,Calculator!$A$6:$A$36,0),MATCH(Q$1&$O156,Calculator!$D$2:$CM$2,0))","v":0.9801098274443335},null,29,"Kerosene",{"$f":"INDEX(Calculator!$D$6:$CM$36,MATCH($S156&U$2,Calculator!$A$6:$A$36,0),MATCH(U$1&$T156,Calculator!$D$2:$CM$2,0))","v":0.9195289521830825},{"$f":"INDEX(Calculator!$D$6:$CM$36,MATCH($S156&V$2,Calculator!$A$6:$A$36,0),MATCH(V$1&$T156,Calculator!$D$2:$CM$2,0))","v":1.0123765651131271},null,null,null,null,null,23,"Coal",{"$f":"INDEX(P156:V156,0, MATCH($AB$1,$P$1:$V$1,0))","v":0.9801098274443335},null,"Coal",23,0.9801098274443335]
[null,null,null,null,null,null,null,null,null,null,null,null,null,24,"Coal",{"$f":"INDEX(Calculator!$D$6:$CM$36,MATCH($N157&P$2,Calculator!$A$6:$A$36,0),MATCH(P$1&$O157,Calculator!$D$2:$CM$2,0))","v":6.2986048529765206},{"$f":"INDEX(Calculator!$D$6:$CM$36,MATCH($N157&Q$2,Calculator!$A$6:$A$36,0),MATCH(Q$1&$O157,Calculator!$D$2:$CM$2,0))","v":6.2986048529765206},null,30,"Kerosene",{"$f":"INDEX(Calculator!$D$6:$CM$36,MATCH($S157&U$2,Calculator!$A$6:$A$36,0),MATCH(U$1&$T157,Calculator!$D$2:$CM$2,0))","v":0.92251748276604073},{"$f":"INDEX(Calculator!$D$6:$CM$36,MATCH($S157&V$2,Calculator!$A$6:$A$36,0),MATCH(V$1&$T157,Calculator!$D$2:$CM$2,0))","v":1.0149595712425108},null,null,null,null,null,24,"Coal",{"$f":"INDEX(P157:V157,0, MATCH($AB$1,$P$1:$V$1,0))","v":6.2986048529765206},null,"Coal",24,6.2986048529765206]
[null,null,null,null,null,null,null,null,null,null,null,null,null,25,"Coal",{"$f":"INDEX(Calculator!$D$6:$CM$36,MATCH($N158&P$2,Calculator!$A$6:$A$36,0),MATCH(P$1&$O158,Calculator!$D$2:$CM$2,0))","v":-4.4961003834566684},{"$f":"INDEX(Calculator!$D$6:$CM$36,MATCH($N158&Q$2,Calculator!$A$6:$A$36,0),MATCH(Q$1&$O158,Calculator!$D$2:$CM$2,0))","v":-4.4961003834566755},null,0,"Wood",{"$f":"INDEX(Calculator!$D$6:$CM$36,MATCH($S158&U$2,Calculator!$A$6:$A$36,0),MATCH(U$1&$T158,Calculator!$D$2:$CM$2,0))","v":1},{"$f":"INDEX(Calculator!$D$6:$CM$36,MATCH($S158&V$2,Calculator!$A$6:$A$36,0),MATCH(V$1&$T158,Calculator!$D$2:$CM$2,0))","v":1},null,null,null,null,null,25,"Coal",{"$f":"INDEX(P158:V158,0, MATCH($AB$1,$P$1:$V$1,0))","v":-4.4961003834566755},null,"Coal",25,-4.4961003834566755]
[null,null,null,null,null,null,null,null,null,null,null,null,null,0,"Kerosene",{"$f":"INDEX(Calculator!$D$6:$CM$36,MATCH($N159&P$2,Calculator!$A$6:$A$36,0),MATCH(P$1&$O159,Calculator!$D$2:$CM$2,0))","v":1},{"$f":"INDEX(Calculator!$D$6:$CM$36,MATCH($N159&Q$2,Calculator!$A$6:$A$36,0),MATCH(Q$1&$O159,Calculator!$D$2:$CM$2,0))","v":1},null,1,"Wood",{"$f":"INDEX(Calculator!$D$6:$CM$36,MATCH($S159&U$2,Calculator!$A$6:$A$36,0),MATCH(U$1&$T159,Calculator!$D$2:$CM$2,0))","v":1},{"$f":"INDEX(Calculator!$D$6:$CM$36,MATCH($S159&V$2,Calculator!$A$6:$A$36,0),MATCH(V$1&$T159,Calculator!$D$2:$CM$2,0))","v":1.0049806756849258},null,null,null,null,null,0,"Kerosene",{"$f":"INDEX(P159:V159,0, MATCH($AB$1,$P$1:$V$1,0))","v":1},null,"Kerosene",0,1]
[null,null,null,null,null,null,null,null,null,null,null,null,null,1,"Kerosene",{"$f":"INDEX(Calculator!$D$6:$CM$36,MATCH($N160&P$2,Calculator!$A$6:$A$36,0),MATCH(P$1&$O160,Calculator!$D$2:$CM$2,0))","v":0.9596828259813811},{"$f":"INDEX(Calculator!$D$6:$CM$36,MATCH($N160&Q$2,Calculator!$A$6:$A$36,0),MATCH(Q$1&$O160,Calculator!$D$2:$CM$2,0))","v":0.96771386467472953},null,2,"Wood",{"$f":"INDEX(Calculator!$D$6:$CM$36,MATCH($S160&U$2,Calculator!$A$6:$A$36,0),MATCH(U$1&$T160,Calculator!$D$2:$CM$2,0))","v":1},{"$f":"INDEX(Calculator!$D$6:$CM$36,MATCH($S160&V$2,Calculator!$A$6:$A$36,0),MATCH(V$1&$T160,Calculator!$D$2:$CM$2,0))","v":1.0099613513698513},null,null,null,null,null,1,"Kerosene",{"$f":"INDEX(P160:V160,0, MATCH($AB$1,$P$1:$V$1,0))","v":0.96771386467472953},null,"Kerosene",1,0.96771386467472953]
[null,null,null,null,null,null,null,null,null,null,null,null,null,2,"Kerosene",{"$f":"INDEX(Calculator!$D$6:$CM$36,MATCH($N161&P$2,Calculator!$A$6:$A$36,0),MATCH(P$1&$O161,Calculator!$D$2:$CM$2,0))","v":0.91330895166801818},{"$f":"INDEX(Calculator!$D$6:$CM$36,MATCH($N161&Q$2,Calculator!$A$6:$A$36,0),MATCH(Q$1&$O161,Calculator!$D$2:$CM$2,0))","v":0.93019288448142434},null,3,"Wood",{"$f":"INDEX(Calculator!$D$6:$CM$36,MATCH($S161&U$2,Calculator!$A$6:$A$36,0),MATCH(U$1&$T161,Calculator!$D$2:$CM$2,0))","v":1},{"$f":"INDEX(Calculator!$D$6:$CM$36,MATCH($S161&V$2,Calculator!$A$6:$A$36,0),MATCH(V$1&$T161,Calculator!$D$2:$CM$2,0))","v":1.0149420270547771},null,null,null,null,null,2,"Kerosene",{"$f":"INDEX(P161:V161,0, MATCH($AB$1,$P$1:$V$1,0))","v":0.93019288448142434},null,"Kerosene",2,0.93019288448142434]
[null,null,null,null,null,null,null,null,null,null,null,null,null,3,"Kerosene",{"$f":"INDEX(Calculator!$D$6:$CM$36,MATCH($N162&P$2,Calculator!$A$6:$A$36,0),MATCH(P$1&$O162,Calculator!$D$2:$CM$2,0))","v":0.88964723820021419},{"$f":"INDEX(Calculator!$D$6:$CM$36,MATCH($N162&Q$2,Calculator!$A$6:$A$36,0),MATCH(Q$1&$O162,Calculator!$D$2:$CM$2,0))","v":0.91230217041628336},null,4,"Wood",{"$f":"INDEX(Calculator!$D$6:$CM$36,MATCH($S162&U$2,Calculator!$A$6:$A$36,0),MATCH(U$1&$T162,Calculator!$D$2:$CM$2,0))","v":1},{"$f":"INDEX(Calculator!$D$6:$CM$36,MATCH($S162&V$2,Calculator!$A$6:$A$36,0),MATCH(V$1&$T162,Calculator!$D$2:$CM$2,0))","v":1.0199227027397026},null,null,null,null,null,3,"Kerosene",{"$f":"INDEX(P162:V162,0, MATCH($AB$1,$P$1:$V$1,0))","v":0.91230217041628336},null,"Kerosene",3,0.91230217041628336]
[null,null,null,null,null,null,null,null,null,null,null,null,null,4,"Kerosene",{"$f":"INDEX(Calculator!$D$6:$CM$36,MATCH($N163&P$2,Calculator!$A$6:$A$36,0),MATCH(P$1&$O163,Calculator!$D$2:$CM$2,0))","v":0.87526585386183964},{"$f":"INDEX(Calculator!$D$6:$CM$36,MATCH($N163&Q$2,Calculator!$A$6:$A$36,0),MATCH(Q$1&$O163,Calculator!$D$2:$CM$2,0))","v":0.9024325042737259},null,5,"Wood",{"$f":"INDEX(Calculator!$D$6:$CM$36,MATCH($S163&U$2,Calculator!$A$6:$A$36,0),MATCH(U$1&$T163,Calculator!$D$2:$CM$2,0))","v":1},{"$f":"INDEX(Calculator!$D$6:$CM$36,MATCH($S163&V$2,Calculator!$A$6:$A$36,0),MATCH(V$1&$T163,Calculator!$D$2:$CM$2,0))","v":1.0298840541095542},null,null,null,null,null,4,"Kerosene",{"$f":"INDEX(P163:V163,0, MATCH($AB$1,$P$1:$V$1,0))","v":0.9024325042737259},null,"Kerosene",4,0.9024325042737259]
[null,null,null,null,null,null,null,null,null,null,null,null,null,5,"Kerosene",{"$f":"INDEX(Calculator!$D$6:$CM$36,MATCH($N164&P$2,Calculator!$A$6:$A$36,0),MATCH(P$1&$O164,Calculator!$D$2:$CM$2,0))","v":0.86232679786134725},{"$f":"INDEX(Calculator!$D$6:$CM$36,MATCH($N164&Q$2,Calculator!$A$6:$A$36,0),MATCH(Q$1&$O164,Calculator!$D$2:$CM$2,0))","v":0.89636970823202466},null,6,"Wood",{"$f":"INDEX(Calculator!$D$6:$CM$36,MATCH($S164&U$2,Calculator!$A$6:$A$36,0),MATCH(U$1&$T164,Calculator!$D$2:$CM$2,0))","v":1},{"$f":"INDEX(Calculator!$D$6:$CM$36,MATCH($S164&V$2,Calculator!$A$6:$A$36,0),MATCH(V$1&$T164,Calculator!$D$2:$CM$2,0))","v":1.03486472979448},null,null,null,null,null,5,"Kerosene",{"$f":"INDEX(P164:V164,0, MATCH($AB$1,$P$1:$V$1,0))","v":0.89636970823202466},null,"Kerosene",5,0.89636970823202466]
[null,null,null,null,null,null,null,null,null,null,null,null,null,6,"Kerosene",{"$f":"INDEX(Calculator!$D$6:$CM$36,MATCH($N165&P$2,Calculator!$A$6:$A$36,0),MATCH(P$1&$O165,Calculator!$D$2:$CM$2,0))","v":0.86097861362888795},{"$f":"INDEX(Calculator!$D$6:$CM$36,MATCH($N165&Q$2,Calculator!$A$6:$A$36,0),MATCH(Q$1&$O165,Calculator!$D$2:$CM$2,0))","v":0.8977647204404382},null,7,"Wood",{"$f":"INDEX(Calculator!$D$6:$CM$36,MATCH($S165&U$2,Calculator!$A$6:$A$36,0),MATCH(U$1&$T165,Calculator!$D$2:$CM$2,0))","v":1},{"$f":"INDEX(Calculator!$D$6:$CM$36,MATCH($S165&V$2,Calculator!$A$6:$A$36,0),MATCH(V$1&$T165,Calculator!$D$2:$CM$2,0))","v":1.0398454054794057},null,null,null,null,null,6,"Kerosene",{"$f":"INDEX(P165:V165,0, MATCH($AB$1,$P$1:$V$1,0))","v":0.8977647204404382},null,"Kerosene",6,0.8977647204404382]
[null,null,null,null,null,null,null,null,null,null,null,null,null,7,"Kerosene",{"$f":"INDEX(Calculator!$D$6:$CM$36,MATCH($N166&P$2,Calculator!$A$6:$A$36,0),MATCH(P$1&$O166,Calculator!$D$2:$CM$2,0))","v":0.86205559858561076},{"$f":"INDEX(Calculator!$D$6:$CM$36,MATCH($N166&Q$2,Calculator!$A$6:$A$36,0),MATCH(Q$1&$O166,Calculator!$D$2:$CM$2,0))","v":0.90125582191632325},null,8,"Wood",{"$f":"INDEX(Calculator!$D$6:$CM$36,MATCH($S166&U$2,Calculator!$A$6:$A$36,0),MATCH(U$1&$T166,Calculator!$D$2:$CM$2,0))","v":1},{"$f":"INDEX(Calculator!$D$6:$CM$36,MATCH($S166&V$2,Calculator!$A$6:$A$36,0),MATCH(V$1&$T166,Calculator!$D$2:$CM$2,0))","v":1.0448260811643313},null,null,null,null,null,7,"Kerosene",{"$f":"INDEX(P166:V166,0, MATCH($AB$1,$P$1:$V$1,0))","v":0.90125582191632325},null,"Kerosene",7,0.90125582191632325]
[null,null,null,null,null,null,null,null,null,null,null,null,null,8,"Kerosene",{"$f":"INDEX(Calculator!$D$6:$CM$36,MATCH($N167&P$2,Calculator!$A$6:$A$36,0),MATCH(P$1&$O167,Calculator!$D$2:$CM$2,0))","v":0.86547726425671789},{"$f":"INDEX(Calculator!$D$6:$CM$36,MATCH($N167&Q$2,Calculator!$A$6:$A$36,0),MATCH(Q$1&$O167,Calculator!$D$2:$CM$2,0))","v":0.90677344595524934},null,9,"Wood",{"$f":"INDEX(Calculator!$D$6:$CM$36,MATCH($S167&U$2,Calculator!$A$6:$A$36,0),MATCH(U$1&$T167,Calculator!$D$2:$CM$2,0))","v":1},{"$f":"INDEX(Calculator!$D$6:$CM$36,MATCH($S167&V$2,Calculator!$A$6:$A$36,0),MATCH(V$1&$T167,Calculator!$D$2:$CM$2,0))","v":1.0498067568492571},null,null,null,null,null,8,"Kerosene",{"$f":"INDEX(P167:V167,0, MATCH($AB$1,$P$1:$V$1,0))","v":0.90677344595524934},null,"Kerosene",8,0.90677344595524934]
[null,null,null,null,null,null,null,null,null,null,null,null,null,9,"Kerosene",{"$f":"INDEX(Calculator!$D$6:$CM$36,MATCH($N168&P$2,Calculator!$A$6:$A$36,0),MATCH(P$1&$O168,Calculator!$D$2:$CM$2,0))","v":0.86933002324909658},{"$f":"INDEX(Calculator!$D$6:$CM$36,MATCH($N168&Q$2,Calculator!$A$6:$A$36,0),MATCH(Q$1&$O168,Calculator!$D$2:$CM$2,0))","v":0.91266366671362364},null,10,"Wood",{"$f":"INDEX(Calculator!$D$6:$CM$36,MATCH($S168&U$2,Calculator!$A$6:$A$36,0),MATCH(U$1&$T168,Calculator!$D$2:$CM$2,0))","v":1},{"$f":"INDEX(Calculator!$D$6:$CM$36,MATCH($S168&V$2,Calculator!$A$6:$A$36,0),MATCH(V$1&$T168,Calculator!$D$2:$CM$2,0))","v":1.0547874325341828},null,null,null,null,null,9,"Kerosene",{"$f":"INDEX(P168:V168,0, MATCH($AB$1,$P$1:$V$1,0))","v":0.91266366671362364},null,"Kerosene",9,0.91266366671362364]
[null,null,null,null,null,null,null,null,null,null,null,null,null,10,"Kerosene",{"$f":"INDEX(Calculator!$D$6:$CM$36,MATCH($N169&P$2,Calculator!$A$6:$A$36,0),MATCH(P$1&$O169,Calculator!$D$2:$CM$2,0))","v":0.87135834742203488},{"$f":"INDEX(Calculator!$D$6:$CM$36,MATCH($N169&Q$2,Calculator!$A$6:$A$36,0),MATCH(Q$1&$O169,Calculator!$D$2:$CM$2,0))","v":0.91697701676900156},null,11,"Wood",{"$f":"INDEX(Calculator!$D$6:$CM$36,MATCH($S169&U$2,Calculator!$A$6:$A$36,0),MATCH(U$1&$T169,Calculator!$D$2:$CM$2,0))","v":1},{"$f":"INDEX(Calculator!$D$6:$CM$36,MATCH($S169&V$2,Calculator!$A$6:$A$36,0),MATCH(V$1&$T169,Calculator!$D$2:$CM$2,0))","v":1.0597681082191086},null,null,null,null,null,10,"Kerosene",{"$f":"INDEX(P169:V169,0, MATCH($AB$1,$P$1:$V$1,0))","v":0.91697701676900156},null,"Kerosene",10,0.91697701676900156]
[null,null,null,null,null,null,null,null,null,null,null,null,null,11,"Kerosene",{"$f":"INDEX(Calculator!$D$6:$CM$36,MATCH($N170&P$2,Calculator!$A$6:$A$36,0),MATCH(P$1&$O170,Calculator!$D$2:$CM$2,0))","v":0.87396763122519694},{"$f":"INDEX(Calculator!$D$6:$CM$36,MATCH($N170&Q$2,Calculator!$A$6:$A$36,0),MATCH(Q$1&$O170,Calculator!$D$2:$CM$2,0))","v":0.92179249395479912},null,12,"Wood",{"$f":"INDEX(Calculator!$D$6:$CM$36,MATCH($S170&U$2,Calculator!$A$6:$A$36,0),MATCH(U$1&$T170,Calculator!$D$2:$CM$2,0))","v":1},{"$f":"INDEX(Calculator!$D$6:$CM$36,MATCH($S170&V$2,Calculator!$A$6:$A$36,0),MATCH(V$1&$T170,Calculator!$D$2:$CM$2,0))","v":1.0647487839040344},null,null,null,null,null,11,"Kerosene",{"$f":"INDEX(P170:V170,0, MATCH($AB$1,$P$1:$V$1,0))","v":0.92179249395479912},null,"Kerosene",11,0.92179249395479912]
[null,null,null,null,null,null,null,null,null,null,null,null,null,12,"Kerosene",{"$f":"INDEX(Calculator!$D$6:$CM$36,MATCH($N171&P$2,Calculator!$A$6:$A$36,0),MATCH(P$1&$O171,Calculator!$D$2:$CM$2,0))","v":0.87693841076462198},{"$f":"INDEX(Calculator!$D$6:$CM$36,MATCH($N171&Q$2,Calculator!$A$6:$A$36,0),MATCH(Q$1&$O171,Calculator!$D$2:$CM$2,0))","v":0.92692041422143312},null,13,"Wood",{"$f":"INDEX(Calculator!$D$6:$CM$36,MATCH($S171&U$2,Calculator!$A$6:$A$36,0),MATCH(U$1&$T171,Calculator!$D$2:$CM$2,0))","v":1},{"$f":"INDEX(Calculator!$D$6:$CM$36,MATCH($S171&V$2,Calculator!$A$6:$A$36,0),MATCH(V$1&$T171,Calculator!$D$2:$CM$2,0))","v":1.0697294595889599},null,null,null,null,null,12,{"$f":"IF(OR($AB$1=\"FPI for v10\", $AB$1=\"FPI_SCC for v10\"), $T171, $O171)","v":"Kerosene"},{"$f":"INDEX(P171:V171,0, MATCH($AB$1,$P$1:$V$1,0))","v":0.92692041422143312},null,"Kerosene",12,0.92692041422143312]
[null,null,null,null,null,null,null,null,null,null,null,null,null,13,"Kerosene",{"$f":"INDEX(Calculator!$D$6:$CM$36,MATCH($N172&P$2,Calculator!$A$6:$A$36,0),MATCH(P$1&$O172,Calculator!$D$2:$CM$2,0))","v":0.87942932981491606},{"$f":"INDEX(Calculator!$D$6:$CM$36,MATCH($N172&Q$2,Calculator!$A$6:$A$36,0),MATCH(Q$1&$O172,Calculator!$D$2:$CM$2,0))","v":0.931633587993003},null,14,"Wood",{"$f":"INDEX(Calculator!$D$6:$CM$36,MATCH($S172&U$2,Calculator!$A$6:$A$36,0),MATCH(U$1&$T172,Calculator!$D$2:$CM$2,0))","v":1},{"$f":"INDEX(Calculator!$D$6:$CM$36,MATCH($S172&V$2,Calculator!$A$6:$A$36,0),MATCH(V$1&$T172,Calculator!$D$2:$CM$2,0))","v":1.0796908109588113},null,null,null,null,null,{"$f":"IF(OR($AB$1=\"FPI for v10\", $AB$1=\"FPI_SCC for v10\"), $S172, $N172)","v":13},"Kerosene",{"$f":"INDEX(P172:V172,0, MATCH($AB$1,$P$1:$V$1,0))","v":0.931633587993003},null,"Kerosene",13,0.931633587993003]
[null,null,null,null,null,null,null,null,null,null,null,null,null,14,"Kerosene",{"$f":"INDEX(Calculator!$D$6:$CM$36,MATCH($N173&P$2,Calculator!$A$6:$A$36,0),MATCH(P$1&$O173,Calculator!$D$2:$CM$2,0))","v":0.88183042675171408},{"$f":"INDEX(Calculator!$D$6:$CM$36,MATCH($N173&Q$2,Calculator!$A$6:$A$36,0),MATCH(Q$1&$O173,Calculator!$D$2:$CM$2,0))","v":0.93882938441431851},null,15,"Wood",{"$f":"INDEX(Calculator!$D$6:$CM$36,MATCH($S173&U$2,Calculator!$A$6:$A$36,0),MATCH(U$1&$T173,Calculator!$D$2:$CM$2,0))","v":1},{"$f":"INDEX(Calculator!$D$6:$CM$36,MATCH($S173&V$2,Calculator!$A$6:$A$36,0),MATCH(V$1&$T173,Calculator!$D$2:$CM$2,0))","v":1.084671486643737},null,null,null,null,null,14,"Kerosene",{"$f":"INDEX(P173:V173,0, MATCH($AB$1,$P$1:$V$1,0))","v":0.93882938441431851},null,"Kerosene",14,0.93882938441431851]
[null,null,null,null,null,null,null,null,null,null,null,null,null,15,"Kerosene",{"$f":"INDEX(Calculator!$D$6:$CM$36,MATCH($N174&P$2,Calculator!$A$6:$A$36,0),MATCH(P$1&$O174,Calculator!$D$2:$CM$2,0))","v":0.88458739626402361},{"$f":"INDEX(Calculator!$D$6:$CM$36,MATCH($N174&Q$2,Calculator!$A$6:$A$36,0),MATCH(Q$1&$O174,Calculator!$D$2:$CM$2,0))","v":0.94377250730470608},null,16,"Wood",{"$f":"INDEX(Calculator!$D$6:$CM$36,MATCH($S174&U$2,Calculator!$A$6:$A$36,0),MATCH(U$1&$T174,Calculator!$D$2:$CM$2,0))","v":1},{"$f":"INDEX(Calculator!$D$6:$CM$36,MATCH($S174&V$2,Calculator!$A$6:$A$36,0),MATCH(V$1&$T174,Calculator!$D$2:$CM$2,0))","v":1.0896521623286628},null,null,null,null,null,15,"Kerosene",{"$f":"INDEX(P174:V174,0, MATCH($AB$1,$P$1:$V$1,0))","v":0.94377250730470608},null,"Kerosene",15,0.94377250730470608]
[null,null,null,null,null,null,null,null,null,null,null,null,null,16,"Kerosene",{"$f":"INDEX(Calculator!$D$6:$CM$36,MATCH($N175&P$2,Calculator!$A$6:$A$36,0),MATCH(P$1&$O175,Calculator!$D$2:$CM$2,0))","v":0.88667469890902706},{"$f":"INDEX(Calculator!$D$6:$CM$36,MATCH($N175&Q$2,Calculator!$A$6:$A$36,0),MATCH(Q$1&$O175,Calculator!$D$2:$CM$2,0))","v":0.94813683283134542},null,17,"Wood",{"$f":"INDEX(Calculator!$D$6:$CM$36,MATCH($S175&U$2,Calculator!$A$6:$A$36,0),MATCH(U$1&$T175,Calculator!$D$2:$CM$2,0))","v":1},{"$f":"INDEX(Calculator!$D$6:$CM$36,MATCH($S175&V$2,Calculator!$A$6:$A$36,0),MATCH(V$1&$T175,Calculator!$D$2:$CM$2,0))","v":1.0946328380135886},null,null,null,null,null,16,"Kerosene",{"$f":"INDEX(P175:V175,0, MATCH($AB$1,$P$1:$V$1,0))","v":0.94813683283134542},null,"Kerosene",16,0.94813683283134542]
[null,null,null,null,null,null,null,null,null,null,null,null,null,17,"Kerosene",{"$f":"INDEX(Calculator!$D$6:$CM$36,MATCH($N176&P$2,Calculator!$A$6:$A$36,0),MATCH(P$1&$O176,Calculator!$D$2:$CM$2,0))","v":0.8889455339191682},{"$f":"INDEX(Calculator!$D$6:$CM$36,MATCH($N176&Q$2,Calculator!$A$6:$A$36,0),MATCH(Q$1&$O176,Calculator!$D$2:$CM$2,0))","v":0.95265978655700501},null,18,"Wood",{"$f":"INDEX(Calculator!$D$6:$CM$36,MATCH($S176&U$2,Calculator!$A$6:$A$36,0),MATCH(U$1&$T176,Calculator!$D$2:$CM$2,0))","v":1},{"$f":"INDEX(Calculator!$D$6:$CM$36,MATCH($S176&V$2,Calculator!$A$6:$A$36,0),MATCH(V$1&$T176,Calculator!$D$2:$CM$2,0))","v":1.0996135136985139},null,null,null,null,null,17,"Kerosene",{"$f":"INDEX(P176:V176,0, MATCH($AB$1,$P$1:$V$1,0))","v":0.95265978655700501},null,"Kerosene",17,0.95265978655700501]
[null,null,null,null,null,null,null,null,null,null,null,null,null,18,"Kerosene",{"$f":"INDEX(Calculator!$D$6:$CM$36,MATCH($N177&P$2,Calculator!$A$6:$A$36,0),MATCH(P$1&$O177,Calculator!$D$2:$CM$2,0))","v":0.89329553387332161},{"$f":"INDEX(Calculator!$D$6:$CM$36,MATCH($N177&Q$2,Calculator!$A$6:$A$36,0),MATCH(Q$1&$O177,Calculator!$D$2:$CM$2,0))","v":0.95897977586430039},null,19,"Wood",{"$f":"INDEX(Calculator!$D$6:$CM$36,MATCH($S177&U$2,Calculator!$A$6:$A$36,0),MATCH(U$1&$T177,Calculator!$D$2:$CM$2,0))","v":1},{"$f":"INDEX(Calculator!$D$6:$CM$36,MATCH($S177&V$2,Calculator!$A$6:$A$36,0),MATCH(V$1&$T177,Calculator!$D$2:$CM$2,0))","v":1.1045941893834397},null,null,null,null,null,18,"Kerosene",{"$f":"INDEX(P177:V177,0, MATCH($AB$1,$P$1:$V$1,0))","v":0.95897977586430039},null,"Kerosene",18,0.95897977586430039]
[null,null,null,null,null,null,null,null,null,null,null,null,null,19,"Kerosene",{"$f":"INDEX(Calculator!$D$6:$CM$36,MATCH($N178&P$2,Calculator!$A$6:$A$36,0),MATCH(P$1&$O178,Calculator!$D$2:$CM$2,0))","v":0.89486521688636955},{"$f":"INDEX(Calculator!$D$6:$CM$36,MATCH($N178&Q$2,Calculator!$A$6:$A$36,0),MATCH(Q$1&$O178,Calculator!$D$2:$CM$2,0))","v":0.96289671942682198},null,20,"Wood",{"$f":"INDEX(Calculator!$D$6:$CM$36,MATCH($S178&U$2,Calculator!$A$6:$A$36,0),MATCH(U$1&$T178,Calculator!$D$2:$CM$2,0))","v":1},{"$f":"INDEX(Calculator!$D$6:$CM$36,MATCH($S178&V$2,Calculator!$A$6:$A$36,0),MATCH(V$1&$T178,Calculator!$D$2:$CM$2,0))","v":1.1095748650683654},null,null,null,null,null,19,"Kerosene",{"$f":"INDEX(P178:V178,0, MATCH($AB$1,$P$1:$V$1,0))","v":0.96289671942682198},null,"Kerosene",19,0.96289671942682198]
[null,null,null,null,null,null,null,null,null,null,null,null,null,20,"Kerosene",{"$f":"INDEX(Calculator!$D$6:$CM$36,MATCH($N179&P$2,Calculator!$A$6:$A$36,0),MATCH(P$1&$O179,Calculator!$D$2:$CM$2,0))","v":0.89775335639638043},{"$f":"INDEX(Calculator!$D$6:$CM$36,MATCH($N179&Q$2,Calculator!$A$6:$A$36,0),MATCH(Q$1&$O179,Calculator!$D$2:$CM$2,0))","v":0.96795321338658591},null,21,"Wood",{"$f":"INDEX(Calculator!$D$6:$CM$36,MATCH($S179&U$2,Calculator!$A$6:$A$36,0),MATCH(U$1&$T179,Calculator!$D$2:$CM$2,0))","v":1},{"$f":"INDEX(Calculator!$D$6:$CM$36,MATCH($S179&V$2,Calculator!$A$6:$A$36,0),MATCH(V$1&$T179,Calculator!$D$2:$CM$2,0))","v":1.119536216438217},null,null,null,null,null,20,"Kerosene",{"$f":"INDEX(P179:V179,0, MATCH($AB$1,$P$1:$V$1,0))","v":0.96795321338658591},null,"Kerosene",20,0.96795321338658591]
[null,null,null,null,null,null,null,null,null,null,null,null,null,21,"Kerosene",{"$f":"INDEX(Calculator!$D$6:$CM$36,MATCH($N180&P$2,Calculator!$A$6:$A$36,0),MATCH(P$1&$O180,Calculator!$D$2:$CM$2,0))","v":0.89710097763432051},{"$f":"INDEX(Calculator!$D$6:$CM$36,MATCH($N180&Q$2,Calculator!$A$6:$A$36,0),MATCH(Q$1&$O180,Calculator!$D$2:$CM$2,0))","v":0.97250987119876353},null,22,"Wood",{"$f":"INDEX(Calculator!$D$6:$CM$36,MATCH($S180&U$2,Calculator!$A$6:$A$36,0),MATCH(U$1&$T180,Calculator!$D$2:$CM$2,0))","v":1},{"$f":"INDEX(Calculator!$D$6:$CM$36,MATCH($S180&V$2,Calculator!$A$6:$A$36,0),MATCH(V$1&$T180,Calculator!$D$2:$CM$2,0))","v":1.1245168921231428},null,null,null,null,null,21,"Kerosene",{"$f":"INDEX(P180:V180,0, MATCH($AB$1,$P$1:$V$1,0))","v":0.97250987119876353},null,"Kerosene",21,0.97250987119876353]
[null,null,null,null,null,null,null,null,null,null,null,null,null,22,"Kerosene",{"$f":"INDEX(Calculator!$D$6:$CM$36,MATCH($N181&P$2,Calculator!$A$6:$A$36,0),MATCH(P$1&$O181,Calculator!$D$2:$CM$2,0))","v":0.8988804625100687},{"$f":"INDEX(Calculator!$D$6:$CM$36,MATCH($N181&Q$2,Calculator!$A$6:$A$36,0),MATCH(Q$1&$O181,Calculator!$D$2:$CM$2,0))","v":0.97660814785534833},null,23,"Wood",{"$f":"INDEX(Calculator!$D$6:$CM$36,MATCH($S181&U$2,Calculator!$A$6:$A$36,0),MATCH(U$1&$T181,Calculator!$D$2:$CM$2,0))","v":1},{"$f":"INDEX(Calculator!$D$6:$CM$36,MATCH($S181&V$2,Calculator!$A$6:$A$36,0),MATCH(V$1&$T181,Calculator!$D$2:$CM$2,0))","v":1.1294975678080683},null,null,null,null,null,22,"Kerosene",{"$f":"INDEX(P181:V181,0, MATCH($AB$1,$P$1:$V$1,0))","v":0.97660814785534833},null,"Kerosene",22,0.97660814785534833]
[null,null,null,null,null,null,null,null,null,null,null,null,null,23,"Kerosene",{"$f":"INDEX(Calculator!$D$6:$CM$36,MATCH($N182&P$2,Calculator!$A$6:$A$36,0),MATCH(P$1&$O182,Calculator!$D$2:$CM$2,0))","v":0.90764854615200052},{"$f":"INDEX(Calculator!$D$6:$CM$36,MATCH($N182&Q$2,Calculator!$A$6:$A$36,0),MATCH(Q$1&$O182,Calculator!$D$2:$CM$2,0))","v":0.98674671519920054},null,24,"Wood",{"$f":"INDEX(Calculator!$D$6:$CM$36,MATCH($S182&U$2,Calculator!$A$6:$A$36,0),MATCH(U$1&$T182,Calculator!$D$2:$CM$2,0))","v":1},{"$f":"INDEX(Calculator!$D$6:$CM$36,MATCH($S182&V$2,Calculator!$A$6:$A$36,0),MATCH(V$1&$T182,Calculator!$D$2:$CM$2,0))","v":1.1344782434929941},null,null,null,null,null,23,"Kerosene",{"$f":"INDEX(P182:V182,0, MATCH($AB$1,$P$1:$V$1,0))","v":0.98674671519920054},null,"Kerosene",23,0.98674671519920054]
[null,null,null,null,null,null,null,null,null,null,null,null,null,24,"Kerosene",{"$f":"INDEX(Calculator!$D$6:$CM$36,MATCH($N183&P$2,Calculator!$A$6:$A$36,0),MATCH(P$1&$O183,Calculator!$D$2:$CM$2,0))","v":5.8743275285842982},{"$f":"INDEX(Calculator!$D$6:$CM$36,MATCH($N183&Q$2,Calculator!$A$6:$A$36,0),MATCH(Q$1&$O183,Calculator!$D$2:$CM$2,0))","v":6.4414127895891449},null,25,"Wood",{"$f":"INDEX(Calculator!$D$6:$CM$36,MATCH($S183&U$2,Calculator!$A$6:$A$36,0),MATCH(U$1&$T183,Calculator!$D$2:$CM$2,0))","v":1},{"$f":"INDEX(Calculator!$D$6:$CM$36,MATCH($S183&V$2,Calculator!$A$6:$A$36,0),MATCH(V$1&$T183,Calculator!$D$2:$CM$2,0))","v":1.1394589191779199},null,null,null,null,null,24,"Kerosene",{"$f":"INDEX(P183:V183,0, MATCH($AB$1,$P$1:$V$1,0))","v":6.4414127895891449},null,"Kerosene",24,6.4414127895891449]
[null,null,null,null,null,null,null,null,null,null,null,null,null,25,"Kerosene",{"$f":"INDEX(Calculator!$D$6:$CM$36,MATCH($N184&P$2,Calculator!$A$6:$A$36,0),MATCH(P$1&$O184,Calculator!$D$2:$CM$2,0))","v":-4.2004557372657754},{"$f":"INDEX(Calculator!$D$6:$CM$36,MATCH($N184&Q$2,Calculator!$A$6:$A$36,0),MATCH(Q$1&$O184,Calculator!$D$2:$CM$2,0))","v":-4.6172545840696948},null,26,"Wood",{"$f":"INDEX(Calculator!$D$6:$CM$36,MATCH($S184&U$2,Calculator!$A$6:$A$36,0),MATCH(U$1&$T184,Calculator!$D$2:$CM$2,0))","v":1},{"$f":"INDEX(Calculator!$D$6:$CM$36,MATCH($S184&V$2,Calculator!$A$6:$A$36,0),MATCH(V$1&$T184,Calculator!$D$2:$CM$2,0))","v":1.1444395948628456},null,null,null,null,null,25,"Kerosene",{"$f":"INDEX(P184:V184,0, MATCH($AB$1,$P$1:$V$1,0))","v":-4.6172545840696948},null,"Kerosene",25,-4.6172545840696948]
[null,null,null,null,null,null,null,null,null,null,null,null,null,0,"Other",{"$f":"INDEX(Calculator!$D$6:$CM$36,MATCH($N185&P$2,Calculator!$A$6:$A$36,0),MATCH(P$1&$O185,Calculator!$D$2:$CM$2,0))","v":1},{"$f":"INDEX(Calculator!$D$6:$CM$36,MATCH($N185&Q$2,Calculator!$A$6:$A$36,0),MATCH(Q$1&$O185,Calculator!$D$2:$CM$2,0))","v":1},null,27,"Wood",{"$f":"INDEX(Calculator!$D$6:$CM$36,MATCH($S185&U$2,Calculator!$A$6:$A$36,0),MATCH(U$1&$T185,Calculator!$D$2:$CM$2,0))","v":1},{"$f":"INDEX(Calculator!$D$6:$CM$36,MATCH($S185&V$2,Calculator!$A$6:$A$36,0),MATCH(V$1&$T185,Calculator!$D$2:$CM$2,0))","v":1.1544009462326972},null,null,null,null,null,0,"Other",{"$f":"INDEX(P185:V185,0, MATCH($AB$1,$P$1:$V$1,0))","v":1},null,"Other",0,1]
[null,null,null,null,null,null,null,null,null,null,null,null,null,1,"Other",{"$f":"INDEX(Calculator!$D$6:$CM$36,MATCH($N186&P$2,Calculator!$A$6:$A$36,0),MATCH(P$1&$O186,Calculator!$D$2:$CM$2,0))","v":1},{"$f":"INDEX(Calculator!$D$6:$CM$36,MATCH($N186&Q$2,Calculator!$A$6:$A$36,0),MATCH(Q$1&$O186,Calculator!$D$2:$CM$2,0))","v":1},null,28,"Wood",{"$f":"INDEX(Calculator!$D$6:$CM$36,MATCH($S186&U$2,Calculator!$A$6:$A$36,0),MATCH(U$1&$T186,Calculator!$D$2:$CM$2,0))","v":1},{"$f":"INDEX(Calculator!$D$6:$CM$36,MATCH($S186&V$2,Calculator!$A$6:$A$36,0),MATCH(V$1&$T186,Calculator!$D$2:$CM$2,0))","v":1.1593816219176227},null,null,null,null,null,1,"Other",{"$f":"INDEX(P186:V186,0, MATCH($AB$1,$P$1:$V$1,0))","v":1},null,"Other",1,1]
[null,null,null,null,null,null,null,null,null,null,null,null,null,2,"Other",{"$f":"INDEX(Calculator!$D$6:$CM$36,MATCH($N187&P$2,Calculator!$A$6:$A$36,0),MATCH(P$1&$O187,Calculator!$D$2:$CM$2,0))","v":1},{"$f":"INDEX(Calculator!$D$6:$CM$36,MATCH($N187&Q$2,Calculator!$A$6:$A$36,0),MATCH(Q$1&$O187,Calculator!$D$2:$CM$2,0))","v":1},null,29,"Wood",{"$f":"INDEX(Calculator!$D$6:$CM$36,MATCH($S187&U$2,Calculator!$A$6:$A$36,0),MATCH(U$1&$T187,Calculator!$D$2:$CM$2,0))","v":1},{"$f":"INDEX(Calculator!$D$6:$CM$36,MATCH($S187&V$2,Calculator!$A$6:$A$36,0),MATCH(V$1&$T187,Calculator!$D$2:$CM$2,0))","v":1.1593816219176227},null,null,null,null,null,2,"Other",{"$f":"INDEX(P187:V187,0, MATCH($AB$1,$P$1:$V$1,0))","v":1},null,"Other",2,1]
[null,null,null,null,null,null,null,null,null,null,null,null,null,3,"Other",{"$f":"INDEX(Calculator!$D$6:$CM$36,MATCH($N188&P$2,Calculator!$A$6:$A$36,0),MATCH(P$1&$O188,Calculator!$D$2:$CM$2,0))","v":1},{"$f":"INDEX(Calculator!$D$6:$CM$36,MATCH($N188&Q$2,Calculator!$A$6:$A$36,0),MATCH(Q$1&$O188,Calculator!$D$2:$CM$2,0))","v":1},null,30,"Wood",{"$f":"INDEX(Calculator!$D$6:$CM$36,MATCH($S188&U$2,Calculator!$A$6:$A$36,0),MATCH(U$1&$T188,Calculator!$D$2:$CM$2,0))","v":1},{"$f":"INDEX(Calculator!$D$6:$CM$36,MATCH($S188&V$2,Calculator!$A$6:$A$36,0),MATCH(V$1&$T188,Calculator!$D$2:$CM$2,0))","v":1.1593816219176227},null,null,null,null,null,3,"Other",{"$f":"INDEX(P188:V188,0, MATCH($AB$1,$P$1:$V$1,0))","v":1},null,"Other",3,1]
[null,null,null,null,null,null,null,null,null,null,null,null,null,4,"Other",{"$f":"INDEX(Calculator!$D$6:$CM$36,MATCH($N189&P$2,Calculator!$A$6:$A$36,0),MATCH(P$1&$O189,Calculator!$D$2:$CM$2,0))","v":1},{"$f":"INDEX(Calculator!$D$6:$CM$36,MATCH($N189&Q$2,Calculator!$A$6:$A$36,0),MATCH(Q$1&$O189,Calculator!$D$2:$CM$2,0))","v":1},null,0,"Coal",{"$f":"INDEX(Calculator!$D$6:$CM$36,MATCH($S189&U$2,Calculator!$A$6:$A$36,0),MATCH(U$1&$T189,Calculator!$D$2:$CM$2,0))","v":1},{"$f":"INDEX(Calculator!$D$6:$CM$36,MATCH($S189&V$2,Calculator!$A$6:$A$36,0),MATCH(V$1&$T189,Calculator!$D$2:$CM$2,0))","v":1},null,null,null,null,null,4,"Other",{"$f":"INDEX(P189:V189,0, MATCH($AB$1,$P$1:$V$1,0))","v":1},null,"Other",4,1]
[null,null,null,null,null,null,null,null,null,null,null,null,null,5,"Other",{"$f":"INDEX(Calculator!$D$6:$CM$36,MATCH($N190&P$2,Calculator!$A$6:$A$36,0),MATCH(P$1&$O190,Calculator!$D$2:$CM$2,0))","v":1},{"$f":"INDEX(Calculator!$D$6:$CM$36,MATCH($N190&Q$2,Calculator!$A$6:$A$36,0),MATCH(Q$1&$O190,Calculator!$D$2:$CM$2,0))","v":1},null,1,"Coal",{"$f":"INDEX(Calculator!$D$6:$CM$36,MATCH($S190&U$2,Calculator!$A$6:$A$36,0),MATCH(U$1&$T190,Calculator!$D$2:$CM$2,0))","v":0.99958037539727507},{"$f":"INDEX(Calculator!$D$6:$CM$36,MATCH($S190&V$2,Calculator!$A$6:$A$36,0),MATCH(V$1&$T190,Calculator!$D$2:$CM$2,0))","v":0.99958037539727507},null,null,null,null,null,5,"Other",{"$f":"INDEX(P190:V190,0, MATCH($AB$1,$P$1:$V$1,0))","v":1},null,"Other",5,1]
[null,null,null,null,null,null,null,null,null,null,null,null,null,6,"Other",{"$f":"INDEX(Calculator!$D$6:$CM$36,MATCH($N191&P$2,Calculator!$A$6:$A$36,0),MATCH(P$1&$O191,Calculator!$D$2:$CM$2,0))","v":1},{"$f":"INDEX(Calculator!$D$6:$CM$36,MATCH($N191&Q$2,Calculator!$A$6:$A$36,0),MATCH(Q$1&$O191,Calculator!$D$2:$CM$2,0))","v":1},null,2,"Coal",{"$f":"INDEX(Calculator!$D$6:$CM$36,MATCH($S191&U$2,Calculator!$A$6:$A$36,0),MATCH(U$1&$T191,Calculator!$D$2:$CM$2,0))","v":1.0154324603239135},{"$f":"INDEX(Calculator!$D$6:$CM$36,MATCH($S191&V$2,Calculator!$A$6:$A$36,0),MATCH(V$1&$T191,Calculator!$D$2:$CM$2,0))","v":1.0154324603239135},null,null,null,null,null,6,"Other",{"$f":"INDEX(P191:V191,0, MATCH($AB$1,$P$1:$V$1,0))","v":1},null,"Other",6,1]
[null,null,null,null,null,null,null,null,null,null,null,null,null,7,"Other",{"$f":"INDEX(Calculator!$D$6:$CM$36,MATCH($N192&P$2,Calculator!$A$6:$A$36,0),MATCH(P$1&$O192,Calculator!$D$2:$CM$2,0))","v":1},{"$f":"INDEX(Calculator!$D$6:$CM$36,MATCH($N192&Q$2,Calculator!$A$6:$A$36,0),MATCH(Q$1&$O192,Calculator!$D$2:$CM$2,0))","v":1},null,3,"Coal",{"$f":"INDEX(Calculator!$D$6:$CM$36,MATCH($S192&U$2,Calculator!$A$6:$A$36,0),MATCH(U$1&$T192,Calculator!$D$2:$CM$2,0))","v":1.0230917597032092},{"$f":"INDEX(Calculator!$D$6:$CM$36,MATCH($S192&V$2,Calculator!$A$6:$A$36,0),MATCH(V$1&$T192,Calculator!$D$2:$CM$2,0))","v":1.0230917597032092},null,null,null,null,null,7,"Other",{"$f":"INDEX(P192:V192,0, MATCH($AB$1,$P$1:$V$1,0))","v":1},null,"Other",7,1]
[null,null,null,null,null,null,null,null,null,null,null,null,null,8,"Other",{"$f":"INDEX(Calculator!$D$6:$CM$36,MATCH($N193&P$2,Calculator!$A$6:$A$36,0),MATCH(P$1&$O193,Calculator!$D$2:$CM$2,0))","v":1},{"$f":"INDEX(Calculator!$D$6:$CM$36,MATCH($N193&Q$2,Calculator!$A$6:$A$36,0),MATCH(Q$1&$O193,Calculator!$D$2:$CM$2,0))","v":1},null,4,"Coal",{"$f":"INDEX(Calculator!$D$6:$CM$36,MATCH($S193&U$2,Calculator!$A$6:$A$36,0),MATCH(U$1&$T193,Calculator!$D$2:$CM$2,0))","v":1.0199693294193084},{"$f":"INDEX(Calculator!$D$6:$CM$36,MATCH($S193&V$2,Calculator!$A$6:$A$36,0),MATCH(V$1&$T193,Calculator!$D$2:$CM$2,0))","v":1.0199693294193084},null,null,null,null,null,8,"Other",{"$f":"INDEX(P193:V193,0, MATCH($AB$1,$P$1:$V$1,0))","v":1},null,"Other",8,1]
[null,null,null,null,null,null,null,null,null,null,null,null,null,9,"Other",{"$f":"INDEX(Calculator!$D$6:$CM$36,MATCH($N194&P$2,Calculator!$A$6:$A$36,0),MATCH(P$1&$O194,Calculator!$D$2:$CM$2,0))","v":1},{"$f":"INDEX(Calculator!$D$6:$CM$36,MATCH($N194&Q$2,Calculator!$A$6:$A$36,0),MATCH(Q$1&$O194,Calculator!$D$2:$CM$2,0))","v":1},null,5,"Coal",{"$f":"INDEX(Calculator!$D$6:$CM$36,MATCH($S194&U$2,Calculator!$A$6:$A$36,0),MATCH(U$1&$T194,Calculator!$D$2:$CM$2,0))","v":1.0125766577111781},{"$f":"INDEX(Calculator!$D$6:$CM$36,MATCH($S194&V$2,Calculator!$A$6:$A$36,0),MATCH(V$1&$T194,Calculator!$D$2:$CM$2,0))","v":1.0125766577111781},null,null,null,null,null,9,"Other",{"$f":"INDEX(P194:V194,0, MATCH($AB$1,$P$1:$V$1,0))","v":1},null,"Other",9,1]
[null,null,null,null,null,null,null,null,null,null,null,null,null,10,"Other",{"$f":"INDEX(Calculator!$D$6:$CM$36,MATCH($N195&P$2,Calculator!$A$6:$A$36,0),MATCH(P$1&$O195,Calculator!$D$2:$CM$2,0))","v":1},{"$f":"INDEX(Calculator!$D$6:$CM$36,MATCH($N195&Q$2,Calculator!$A$6:$A$36,0),MATCH(Q$1&$O195,Calculator!$D$2:$CM$2,0))","v":1},null,6,"Coal",{"$f":"INDEX(Calculator!$D$6:$CM$36,MATCH($S195&U$2,Calculator!$A$6:$A$36,0),MATCH(U$1&$T195,Calculator!$D$2:$CM$2,0))","v":1.0072756330471637},{"$f":"INDEX(Calculator!$D$6:$CM$36,MATCH($S195&V$2,Calculator!$A$6:$A$36,0),MATCH(V$1&$T195,Calculator!$D$2:$CM$2,0))","v":1.0072756330471637},null,null,null,null,null,10,"Other",{"$f":"INDEX(P195:V195,0, MATCH($AB$1,$P$1:$V$1,0))","v":1},null,"Other",10,1]
[null,null,null,null,null,null,null,null,null,null,null,null,null,11,"Other",{"$f":"INDEX(Calculator!$D$6:$CM$36,MATCH($N196&P$2,Calculator!$A$6:$A$36,0),MATCH(P$1&$O196,Calculator!$D$2:$CM$2,0))","v":1},{"$f":"INDEX(Calculator!$D$6:$CM$36,MATCH($N196&Q$2,Calculator!$A$6:$A$36,0),MATCH(Q$1&$O196,Calculator!$D$2:$CM$2,0))","v":1},null,7,"Coal",{"$f":"INDEX(Calculator!$D$6:$CM$36,MATCH($S196&U$2,Calculator!$A$6:$A$36,0),MATCH(U$1&$T196,Calculator!$D$2:$CM$2,0))","v":1.0031508877058128},{"$f":"INDEX(Calculator!$D$6:$CM$36,MATCH($S196&V$2,Calculator!$A$6:$A$36,0),MATCH(V$1&$T196,Calculator!$D$2:$CM$2,0))","v":1.0031508877058128},null,null,null,null,null,11,"Other",{"$f":"INDEX(P196:V196,0, MATCH($AB$1,$P$1:$V$1,0))","v":1},null,{"$f":"AC196","v":"Other"},{"$f":"AB196","v":11},1]
[null,null,null,null,null,null,null,null,null,null,null,null,null,12,"Other",{"$f":"INDEX(Calculator!$D$6:$CM$36,MATCH($N197&P$2,Calculator!$A$6:$A$36,0),MATCH(P$1&$O197,Calculator!$D$2:$CM$2,0))","v":1},{"$f":"INDEX(Calculator!$D$6:$CM$36,MATCH($N197&Q$2,Calculator!$A$6:$A$36,0),MATCH(Q$1&$O197,Calculator!$D$2:$CM$2,0))","v":1},null,8,"Coal",{"$f":"INDEX(Calculator!$D$6:$CM$36,MATCH($S197&U$2,Calculator!$A$6:$A$36,0),MATCH(U$1&$T197,Calculator!$D$2:$CM$2,0))","v":0.998864722589065},{"$f":"INDEX(Calculator!$D$6:$CM$36,MATCH($S197&V$2,Calculator!$A$6:$A$36,0),MATCH(V$1&$T197,Calculator!$D$2:$CM$2,0))","v":0.998864722589065},null,null,null,null,null,12,"Other",{"$f":"INDEX(P197:V197,0, MATCH($AB$1,$P$1:$V$1,0))","v":1},null,"Other",12,1]
[null,null,null,null,null,null,null,null,null,null,null,null,null,13,"Other",{"$f":"INDEX(Calculator!$D$6:$CM$36,MATCH($N198&P$2,Calculator!$A$6:$A$36,0),MATCH(P$1&$O198,Calculator!$D$2:$CM$2,0))","v":1},{"$f":"INDEX(Calculator!$D$6:$CM$36,MATCH($N198&Q$2,Calculator!$A$6:$A$36,0),MATCH(Q$1&$O198,Calculator!$D$2:$CM$2,0))","v":1},null,9,"Coal",{"$f":"INDEX(Calculator!$D$6:$CM$36,MATCH($S198&U$2,Calculator!$A$6:$A$36,0),MATCH(U$1&$T198,Calculator!$D$2:$CM$2,0))","v":0.99395382073894578},{"$f":"INDEX(Calculator!$D$6:$CM$36,MATCH($S198&V$2,Calculator!$A$6:$A$36,0),MATCH(V$1&$T198,Calculator!$D$2:$CM$2,0))","v":0.99395382073894578},null,null,null,null,null,13,"Other",{"$f":"INDEX(P198:V198,0, MATCH($AB$1,$P$1:$V$1,0))","v":1},null,"Other",13,1]
[null,null,null,null,null,null,null,null,null,null,null,null,null,14,"Other",{"$f":"INDEX(Calculator!$D$6:$CM$36,MATCH($N199&P$2,Calculator!$A$6:$A$36,0),MATCH(P$1&$O199,Calculator!$D$2:$CM$2,0))","v":1},{"$f":"INDEX(Calculator!$D$6:$CM$36,MATCH($N199&Q$2,Calculator!$A$6:$A$36,0),MATCH(Q$1&$O199,Calculator!$D$2:$CM$2,0))","v":1},null,10,"Coal",{"$f":"INDEX(Calculator!$D$6:$CM$36,MATCH($S199&U$2,Calculator!$A$6:$A$36,0),MATCH(U$1&$T199,Calculator!$D$2:$CM$2,0))","v":0.98999259627037806},{"$f":"INDEX(Calculator!$D$6:$CM$36,MATCH($S199&V$2,Calculator!$A$6:$A$36,0),MATCH(V$1&$T199,Calculator!$D$2:$CM$2,0))","v":0.98999259627037806},null,null,null,null,null,14,"Other",{"$f":"INDEX(P199:V199,0, MATCH($AB$1,$P$1:$V$1,0))","v":1},null,"Other",14,1]
[null,null,null,null,null,null,null,null,null,null,null,null,null,15,"Other",{"$f":"INDEX(Calculator!$D$6:$CM$36,MATCH($N200&P$2,Calculator!$A$6:$A$36,0),MATCH(P$1&$O200,Calculator!$D$2:$CM$2,0))","v":1},{"$f":"INDEX(Calculator!$D$6:$CM$36,MATCH($N200&Q$2,Calculator!$A$6:$A$36,0),MATCH(Q$1&$O200,Calculator!$D$2:$CM$2,0))","v":1},null,11,"Coal",{"$f":"INDEX(Calculator!$D$6:$CM$36,MATCH($S200&U$2,Calculator!$A$6:$A$36,0),MATCH(U$1&$T200,Calculator!$D$2:$CM$2,0))","v":0.98754377488635114},{"$f":"INDEX(Calculator!$D$6:$CM$36,MATCH($S200&V$2,Calculator!$A$6:$A$36,0),MATCH(V$1&$T200,Calculator!$D$2:$CM$2,0))","v":0.98754377488635114},null,null,null,null,null,15,"Other",{"$f":"INDEX(P200:V200,0, MATCH($AB$1,$P$1:$V$1,0))","v":1},null,"Other",15,1]
[null,null,null,null,null,null,null,null,null,null,null,null,null,16,"Other",{"$f":"INDEX(Calculator!$D$6:$CM$36,MATCH($N201&P$2,Calculator!$A$6:$A$36,0),MATCH(P$1&$O201,Calculator!$D$2:$CM$2,0))","v":1},{"$f":"INDEX(Calculator!$D$6:$CM$36,MATCH($N201&Q$2,Calculator!$A$6:$A$36,0),MATCH(Q$1&$O201,Calculator!$D$2:$CM$2,0))","v":1},null,12,"Coal",{"$f":"INDEX(Calculator!$D$6:$CM$36,MATCH($S201&U$2,Calculator!$A$6:$A$36,0),MATCH(U$1&$T201,Calculator!$D$2:$CM$2,0))","v":0.98550263565661222},{"$f":"INDEX(Calculator!$D$6:$CM$36,MATCH($S201&V$2,Calculator!$A$6:$A$36,0),MATCH(V$1&$T201,Calculator!$D$2:$CM$2,0))","v":0.98550263565661234},null,null,null,null,null,16,"Other",{"$f":"INDEX(P201:V201,0, MATCH($AB$1,$P$1:$V$1,0))","v":1},null,"Other",16,1]
[null,null,null,null,null,null,null,null,null,null,null,null,null,17,"Other",{"$f":"INDEX(Calculator!$D$6:$CM$36,MATCH($N202&P$2,Calculator!$A$6:$A$36,0),MATCH(P$1&$O202,Calculator!$D$2:$CM$2,0))","v":1},{"$f":"INDEX(Calculator!$D$6:$CM$36,MATCH($N202&Q$2,Calculator!$A$6:$A$36,0),MATCH(Q$1&$O202,Calculator!$D$2:$CM$2,0))","v":1},null,13,"Coal",{"$f":"INDEX(Calculator!$D$6:$CM$36,MATCH($S202&U$2,Calculator!$A$6:$A$36,0),MATCH(U$1&$T202,Calculator!$D$2:$CM$2,0))","v":0.983826355068257},{"$f":"INDEX(Calculator!$D$6:$CM$36,MATCH($S202&V$2,Calculator!$A$6:$A$36,0),MATCH(V$1&$T202,Calculator!$D$2:$CM$2,0))","v":0.983826355068257},null,null,null,null,null,17,"Other",{"$f":"INDEX(P202:V202,0, MATCH($AB$1,$P$1:$V$1,0))","v":1},null,"Other",17,1]
[null,null,null,null,null,null,null,null,null,null,null,null,null,18,"Other",{"$f":"INDEX(Calculator!$D$6:$CM$36,MATCH($N203&P$2,Calculator!$A$6:$A$36,0),MATCH(P$1&$O203,Calculator!$D$2:$CM$2,0))","v":1},{"$f":"INDEX(Calculator!$D$6:$CM$36,MATCH($N203&Q$2,Calculator!$A$6:$A$36,0),MATCH(Q$1&$O203,Calculator!$D$2:$CM$2,0))","v":1},null,14,"Coal",{"$f":"INDEX(Calculator!$D$6:$CM$36,MATCH($S203&U$2,Calculator!$A$6:$A$36,0),MATCH(U$1&$T203,Calculator!$D$2:$CM$2,0))","v":0.98293976559455631},{"$f":"INDEX(Calculator!$D$6:$CM$36,MATCH($S203&V$2,Calculator!$A$6:$A$36,0),MATCH(V$1&$T203,Calculator!$D$2:$CM$2,0))","v":0.98293976559455631},null,null,null,null,null,18,"Other",{"$f":"INDEX(P203:V203,0, MATCH($AB$1,$P$1:$V$1,0))","v":1},null,"Other",18,{"$f":"AD203","v":1}]
[null,null,null,null,null,null,null,null,null,null,null,null,null,19,"Other",{"$f":"INDEX(Calculator!$D$6:$CM$36,MATCH($N204&P$2,Calculator!$A$6:$A$36,0),MATCH(P$1&$O204,Calculator!$D$2:$CM$2,0))","v":1},{"$f":"INDEX(Calculator!$D$6:$CM$36,MATCH($N204&Q$2,Calculator!$A$6:$A$36,0),MATCH(Q$1&$O204,Calculator!$D$2:$CM$2,0))","v":1},null,15,"Coal",{"$f":"INDEX(Calculator!$D$6:$CM$36,MATCH($S204&U$2,Calculator!$A$6:$A$36,0),MATCH(U$1&$T204,Calculator!$D$2:$CM$2,0))","v":0.98280573923407222},{"$f":"INDEX(Calculator!$D$6:$CM$36,MATCH($S204&V$2,Calculator!$A$6:$A$36,0),MATCH(V$1&$T204,Calculator!$D$2:$CM$2,0))","v":0.98280573923407222},null,null,null,null,null,19,"Other",{"$f":"INDEX(P204:V204,0, MATCH($AB$1,$P$1:$V$1,0))","v":1},null,"Other",19,1]
[null,null,null,null,null,null,null,null,null,null,null,null,null,20,"Other",{"$f":"INDEX(Calculator!$D$6:$CM$36,MATCH($N205&P$2,Calculator!$A$6:$A$36,0),MATCH(P$1&$O205,Calculator!$D$2:$CM$2,0))","v":1},{"$f":"INDEX(Calculator!$D$6:$CM$36,MATCH($N205&Q$2,Calculator!$A$6:$A$36,0),MATCH(Q$1&$O205,Calculator!$D$2:$CM$2,0))","v":1},null,16,"Coal",{"$f":"INDEX(Calculator!$D$6:$CM$36,MATCH($S205&U$2,Calculator!$A$6:$A$36,0),MATCH(U$1&$T205,Calculator!$D$2:$CM$2,0))","v":0.98242345287969679},{"$f":"INDEX(Calculator!$D$6:$CM$36,MATCH($S205&V$2,Calculator!$A$6:$A$36,0),MATCH(V$1&$T205,Calculator!$D$2:$CM$2,0))","v":0.98242345287969679},null,null,null,null,null,20,"Other",{"$f":"INDEX(P205:V205,0, MATCH($AB$1,$P$1:$V$1,0))","v":1},null,"Other",20,1]
[null,null,null,null,null,null,null,null,null,null,null,null,null,21,"Other",{"$f":"INDEX(Calculator!$D$6:$CM$36,MATCH($N206&P$2,Calculator!$A$6:$A$36,0),MATCH(P$1&$O206,Calculator!$D$2:$CM$2,0))","v":1},{"$f":"INDEX(Calculator!$D$6:$CM$36,MATCH($N206&Q$2,Calculator!$A$6:$A$36,0),MATCH(Q$1&$O206,Calculator!$D$2:$CM$2,0))","v":1},null,17,"Coal",{"$f":"INDEX(Calculator!$D$6:$CM$36,MATCH($S206&U$2,Calculator!$A$6:$A$36,0),MATCH(U$1&$T206,Calculator!$D$2:$CM$2,0))","v":0.98069830369882582},{"$f":"INDEX(Calculator!$D$6:$CM$36,MATCH($S206&V$2,Calculator!$A$6:$A$36,0),MATCH(V$1&$T206,Calculator!$D$2:$CM$2,0))","v":0.98069830369882582},null,null,null,null,null,21,"Other",{"$f":"INDEX(P206:V206,0, MATCH($AB$1,$P$1:$V$1,0))","v":1},null,"Other",21,1]
[null,null,null,null,null,null,null,null,null,null,null,null,null,22,"Other",{"$f":"INDEX(Calculator!$D$6:$CM$36,MATCH($N207&P$2,Calculator!$A$6:$A$36,0),MATCH(P$1&$O207,Calculator!$D$2:$CM$2,0))","v":1},{"$f":"INDEX(Calculator!$D$6:$CM$36,MATCH($N207&Q$2,Calculator!$A$6:$A$36,0),MATCH(Q$1&$O207,Calculator!$D$2:$CM$2,0))","v":1},null,18,"Coal",{"$f":"INDEX(Calculator!$D$6:$CM$36,MATCH($S207&U$2,Calculator!$A$6:$A$36,0),MATCH(U$1&$T207,Calculator!$D$2:$CM$2,0))","v":0.97898990127258756},{"$f":"INDEX(Calculator!$D$6:$CM$36,MATCH($S207&V$2,Calculator!$A$6:$A$36,0),MATCH(V$1&$T207,Calculator!$D$2:$CM$2,0))","v":0.97898990127258756},null,null,null,null,null,22,"Other",{"$f":"INDEX(P207:V207,0, MATCH($AB$1,$P$1:$V$1,0))","v":1},null,"Other",22,1]
[null,null,null,null,null,null,null,null,null,null,null,null,null,23,"Other",{"$f":"INDEX(Calculator!$D$6:$CM$36,MATCH($N208&P$2,Calculator!$A$6:$A$36,0),MATCH(P$1&$O208,Calculator!$D$2:$CM$2,0))","v":1},{"$f":"INDEX(Calculator!$D$6:$CM$36,MATCH($N208&Q$2,Calculator!$A$6:$A$36,0),MATCH(Q$1&$O208,Calculator!$D$2:$CM$2,0))","v":1},null,19,"Coal",{"$f":"INDEX(Calculator!$D$6:$CM$36,MATCH($S208&U$2,Calculator!$A$6:$A$36,0),MATCH(U$1&$T208,Calculator!$D$2:$CM$2,0))","v":0.97734247820694897},{"$f":"INDEX(Calculator!$D$6:$CM$36,MATCH($S208&V$2,Calculator!$A$6:$A$36,0),MATCH(V$1&$T208,Calculator!$D$2:$CM$2,0))","v":0.97734247820694897},null,null,null,null,null,23,"Other",{"$f":"INDEX(P208:V208,0, MATCH($AB$1,$P$1:$V$1,0))","v":1},null,"Other",23,1]
[null,null,null,null,null,null,null,null,null,null,null,null,null,24,"Other",{"$f":"INDEX(Calculator!$D$6:$CM$36,MATCH($N209&P$2,Calculator!$A$6:$A$36,0),MATCH(P$1&$O209,Calculator!$D$2:$CM$2,0))","v":6.4171914438781892},{"$f":"INDEX(Calculator!$D$6:$CM$36,MATCH($N209&Q$2,Calculator!$A$6:$A$36,0),MATCH(Q$1&$O209,Calculator!$D$2:$CM$2,0))","v":6.4171914438781892},null,20,"Coal",{"$f":"INDEX(Calculator!$D$6:$CM$36,MATCH($S209&U$2,Calculator!$A$6:$A$36,0),MATCH(U$1&$T209,Calculator!$D$2:$CM$2,0))","v":0.97725979661604001},{"$f":"INDEX(Calculator!$D$6:$CM$36,MATCH($S209&V$2,Calculator!$A$6:$A$36,0),MATCH(V$1&$T209,Calculator!$D$2:$CM$2,0))","v":0.97725979661604012},null,null,null,null,null,24,"Other",{"$f":"INDEX(P209:V209,0, MATCH($AB$1,$P$1:$V$1,0))","v":6.4171914438781892},null,"Other",24,6.4171914438781892]
[null,null,null,null,null,null,null,null,null,null,null,null,null,25,"Other",{"$f":"INDEX(Calculator!$D$6:$CM$36,MATCH($N210&P$2,Calculator!$A$6:$A$36,0),MATCH(P$1&$O210,Calculator!$D$2:$CM$2,0))","v":-4.5797071871945407},{"$f":"INDEX(Calculator!$D$6:$CM$36,MATCH($N210&Q$2,Calculator!$A$6:$A$36,0),MATCH(Q$1&$O210,Calculator!$D$2:$CM$2,0))","v":-4.5797071871945407},null,21,"Coal",{"$f":"INDEX(Calculator!$D$6:$CM$36,MATCH($S210&U$2,Calculator!$A$6:$A$36,0),MATCH(U$1&$T210,Calculator!$D$2:$CM$2,0))","v":0.97796753592336461},{"$f":"INDEX(Calculator!$D$6:$CM$36,MATCH($S210&V$2,Calculator!$A$6:$A$36,0),MATCH(V$1&$T210,Calculator!$D$2:$CM$2,0))","v":0.97796753592336461},null,null,null,null,null,25,"Other",{"$f":"INDEX(P210:V210,0, MATCH($AB$1,$P$1:$V$1,0))","v":-4.5797071871945407},null,"Other",25,-4.5797071871945407]
[null,null,null,null,null,null,null,null,null,null,null,null,null,"  ","  ","  ","  ",null,22,"Coal",{"$f":"INDEX(Calculator!$D$6:$CM$36,MATCH($S211&U$2,Calculator!$A$6:$A$36,0),MATCH(U$1&$T211,Calculator!$D$2:$CM$2,0))","v":0.97985988033346649},{"$f":"INDEX(Calculator!$D$6:$CM$36,MATCH($S211&V$2,Calculator!$A$6:$A$36,0),MATCH(V$1&$T211,Calculator!$D$2:$CM$2,0))","v":0.97985988033346649},null,null,null,null,null,"  ","  ",{"$f":"INDEX(P211:V211,0, MATCH($AB$1,$P$1:$V$1,0))","v":"  "},null,"  ","  ","  "]
[null,null,null,null,null,null,null,null,null,null,null,null,null,"  ","  ","  ","  ",null,23,"Coal",{"$f":"INDEX(Calculator!$D$6:$CM$36,MATCH($S212&U$2,Calculator!$A$6:$A$36,0),MATCH(U$1&$T212,Calculator!$D$2:$CM$2,0))","v":0.9801098274443335},{"$f":"INDEX(Calculator!$D$6:$CM$36,MATCH($S212&V$2,Calculator!$A$6:$A$36,0),MATCH(V$1&$T212,Calculator!$D$2:$CM$2,0))","v":0.9801098274443335},null,null,null,null,null,"  ","  ",{"$f":"INDEX(P212:V212,0, MATCH($AB$1,$P$1:$V$1,0))","v":"  "},null,"  ","  ","  "]
[null,null,null,null,null,null,null,null,null,null,null,null,null,"  ","  ","  ","  ",null,24,"Coal",{"$f":"INDEX(Calculator!$D$6:$CM$36,MATCH($S213&U$2,Calculator!$A$6:$A$36,0),MATCH(U$1&$T213,Calculator!$D$2:$CM$2,0))","v":0.980564916387616},{"$f":"INDEX(Calculator!$D$6:$CM$36,MATCH($S213&V$2,Calculator!$A$6:$A$36,0),MATCH(V$1&$T213,Calculator!$D$2:$CM$2,0))","v":0.980564916387616},null,null,null,null,null,"  ","  ",{"$f":"INDEX(P213:V213,0, MATCH($AB$1,$P$1:$V$1,0))","v":"  "},null,"  ","  ","  "]
[null,null,null,null,null,null,null,null,null,null,null,null,null,"  ","  ","  ","  ",null,25,"Coal",{"$f":"INDEX(Calculator!$D$6:$CM$36,MATCH($S214&U$2,Calculator!$A$6:$A$36,0),MATCH(U$1&$T214,Calculator!$D$2:$CM$2,0))","v":0.98148075122989853},{"$f":"INDEX(Calculator!$D$6:$CM$36,MATCH($S214&V$2,Calculator!$A$6:$A$36,0),MATCH(V$1&$T214,Calculator!$D$2:$CM$2,0))","v":0.98148075122989864},null,null,null,null,null,"  ","  ",{"$f":"INDEX(P214:V214,0, MATCH($AB$1,$P$1:$V$1,0))","v":"  "},null,"  ","  ","  "]
[null,null,null,null,null,null,null,null,null,null,null,null,null,"  ","  ","  ","  ",null,26,"Coal",{"$f":"INDEX(Calculator!$D$6:$CM$36,MATCH($S215&U$2,Calculator!$A$6:$A$36,0),MATCH(U$1&$T215,Calculator!$D$2:$CM$2,0))","v":0.98199346216941363},{"$f":"INDEX(Calculator!$D$6:$CM$36,MATCH($S215&V$2,Calculator!$A$6:$A$36,0),MATCH(V$1&$T215,Calculator!$D$2:$CM$2,0))","v":0.98199346216941363},null,null,null,null,null,"  ","  ",{"$f":"INDEX(P215:V215,0, MATCH($AB$1,$P$1:$V$1,0))","v":"  "},null,"  ","  ","  "]
[null,null,null,null,null,null,null,null,null,null,null,null,null,"  ","  ","  ","  ",null,27,"Coal",{"$f":"INDEX(Calculator!$D$6:$CM$36,MATCH($S216&U$2,Calculator!$A$6:$A$36,0),MATCH(U$1&$T216,Calculator!$D$2:$CM$2,0))","v":0.98155986475863388},{"$f":"INDEX(Calculator!$D$6:$CM$36,MATCH($S216&V$2,Calculator!$A$6:$A$36,0),MATCH(V$1&$T216,Calculator!$D$2:$CM$2,0))","v":0.98155986475863388},null,null,null,null,null,"  ","  ",{"$f":"INDEX(P216:V216,0, MATCH($AB$1,$P$1:$V$1,0))","v":"  "},null,"  ","  ","  "]
[null,null,null,null,null,null,null,null,null,null,null,null,null,"  ","  ","  ","  ",null,28,"Coal",{"$f":"INDEX(Calculator!$D$6:$CM$36,MATCH($S217&U$2,Calculator!$A$6:$A$36,0),MATCH(U$1&$T217,Calculator!$D$2:$CM$2,0))","v":0.98152973322541404},{"$f":"INDEX(Calculator!$D$6:$CM$36,MATCH($S217&V$2,Calculator!$A$6:$A$36,0),MATCH(V$1&$T217,Calculator!$D$2:$CM$2,0))","v":0.98152973322541404},null,null,null,null,null,"  ","  ",{"$f":"INDEX(P217:V217,0, MATCH($AB$1,$P$1:$V$1,0))","v":"  "},null,"  ","  ","  "]
[null,null,null,null,null,null,null,null,null,null,null,null,null,"  ","  ","  ","  ",null,29,"Coal",{"$f":"INDEX(Calculator!$D$6:$CM$36,MATCH($S218&U$2,Calculator!$A$6:$A$36,0),MATCH(U$1&$T218,Calculator!$D$2:$CM$2,0))","v":0.98172216242250709},{"$f":"INDEX(Calculator!$D$6:$CM$36,MATCH($S218&V$2,Calculator!$A$6:$A$36,0),MATCH(V$1&$T218,Calculator!$D$2:$CM$2,0))","v":0.98172216242250721},null,null,null,null,null,"  ","  ",{"$f":"INDEX(P218:V218,0, MATCH($AB$1,$P$1:$V$1,0))","v":"  "},null,"  ","  ","  "]
[null,null,null,null,null,null,null,null,null,null,null,null,null,"  ","  ","  ","  ",null,30,"Coal",{"$f":"INDEX(Calculator!$D$6:$CM$36,MATCH($S219&U$2,Calculator!$A$6:$A$36,0),MATCH(U$1&$T219,Calculator!$D$2:$CM$2,0))","v":0.98191462934540152},{"$f":"INDEX(Calculator!$D$6:$CM$36,MATCH($S219&V$2,Calculator!$A$6:$A$36,0),MATCH(V$1&$T219,Calculator!$D$2:$CM$2,0))","v":0.98191462934540152},null,null,null,null,null,"  ","  ",{"$f":"INDEX(P219:V219,0, MATCH($AB$1,$P$1:$V$1,0))","v":"  "},null,"  ","  ","  "]
[null,null,null,null,null,null,null,null,null,null,null,null,null,"  ","  ","  ","  ",null,0,"Other",{"$f":"INDEX(Calculator!$D$6:$CM$36,MATCH($S220&U$2,Calculator!$A$6:$A$36,0),MATCH(U$1&$T220,Calculator!$D$2:$CM$2,0))","v":1},{"$f":"INDEX(Calculator!$D$6:$CM$36,MATCH($S220&V$2,Calculator!$A$6:$A$36,0),MATCH(V$1&$T220,Calculator!$D$2:$CM$2,0))","v":1},null,null,null,null,null,"  ","  ",{"$f":"INDEX(P220:V220,0, MATCH($AB$1,$P$1:$V$1,0))","v":"  "},null,"  ","  ","  "]
[null,null,null,null,null,null,null,null,null,null,null,null,null,"  ","  ","  ","  ",null,1,"Other",{"$f":"INDEX(Calculator!$D$6:$CM$36,MATCH($S221&U$2,Calculator!$A$6:$A$36,0),MATCH(U$1&$T221,Calculator!$D$2:$CM$2,0))","v":1},{"$f":"INDEX(Calculator!$D$6:$CM$36,MATCH($S221&V$2,Calculator!$A$6:$A$36,0),MATCH(V$1&$T221,Calculator!$D$2:$CM$2,0))","v":1},null,null,null,null,null,"  ","  ",{"$f":"INDEX(P221:V221,0, MATCH($AB$1,$P$1:$V$1,0))","v":"  "},null,"  ","  ","  "]
[null,null,null,null,null,null,null,null,null,null,null,null,null,"  ","  ","  ","  ",null,2,"Other",{"$f":"INDEX(Calculator!$D$6:$CM$36,MATCH($S222&U$2,Calculator!$A$6:$A$36,0),MATCH(U$1&$T222,Calculator!$D$2:$CM$2,0))","v":1},{"$f":"INDEX(Calculator!$D$6:$CM$36,MATCH($S222&V$2,Calculator!$A$6:$A$36,0),MATCH(V$1&$T222,Calculator!$D$2:$CM$2,0))","v":1},null,null,null,null,null,"  ","  ",{"$f":"INDEX(P222:V222,0, MATCH($AB$1,$P$1:$V$1,0))","v":"  "},null,"  ","  ","  "]
[null,null,null,null,null,null,null,null,null,null,null,null,null,"  ","  ","  ","  ",null,3,"Other",{"$f":"INDEX(Calculator!$D$6:$CM$36,MATCH($S223&U$2,Calculator!$A$6:$A$36,0),MATCH(U$1&$T223,Calculator!$D$2:$CM$2,0))","v":1},{"$f":"INDEX(Calculator!$D$6:$CM$36,MATCH($S223&V$2,Calculator!$A$6:$A$36,0),MATCH(V$1&$T223,Calculator!$D$2:$CM$2,0))","v":1},null,null,null,null,null,"  ","  ",{"$f":"INDEX(P223:V223,0, MATCH($AB$1,$P$1:$V$1,0))","v":"  "},null,"  ","  ","  "]
[null,null,null,null,null,null,null,null,null,null,null,null,null,"  ","  ","  ","  ",null,4,"Other",{"$f":"INDEX(Calculator!$D$6:$CM$36,MATCH($S224&U$2,Calculator!$A$6:$A$36,0),MATCH(U$1&$T224,Calculator!$D$2:$CM$2,0))","v":1},{"$f":"INDEX(Calculator!$D$6:$CM$36,MATCH($S224&V$2,Calculator!$A$6:$A$36,0),MATCH(V$1&$T224,Calculator!$D$2:$CM$2,0))","v":1},null,null,null,null,null,"  ","  ",{"$f":"INDEX(P224:V224,0, MATCH($AB$1,$P$1:$V$1,0))","v":"  "},null,"  ","  ","  "]
[null,null,null,null,null,null,null,null,null,null,null,null,null,"  ","  ","  ","  ",null,5,"Other",{"$f":"INDEX(Calculator!$D$6:$CM$36,MATCH($S225&U$2,Calculator!$A$6:$A$36,0),MATCH(U$1&$T225,Calculator!$D$2:$CM$2,0))","v":1},{"$f":"INDEX(Calculator!$D$6:$CM$36,MATCH($S225&V$2,Calculator!$A$6:$A$36,0),MATCH(V$1&$T225,Calculator!$D$2:$CM$2,0))","v":1},null,null,null,null,null,"  ","  ",{"$f":"INDEX(P225:V225,0, MATCH($AB$1,$P$1:$V$1,0))","v":"  "},null,"  ","  ","  "]
[null,null,null,null,null,null,null,null,null,null,null,null,null,"  ","  ","  ","  ",null,6,"Other",{"$f":"INDEX(Calculator!$D$6:$CM$36,MATCH($S226&U$2,Calculator!$A$6:$A$36,0),MATCH(U$1&$T226,Calculator!$D$2:$CM$2,0))","v":1},{"$f":"INDEX(Calculator!$D$6:$CM$36,MATCH($S226&V$2,Calculator!$A$6:$A$36,0),MATCH(V$1&$T226,Calculator!$D$2:$CM$2,0))","v":1},null,null,null,null,null,"  ","  ",{"$f":"INDEX(P226:V226,0, MATCH($AB$1,$P$1:$V$1,0))","v":"  "},null,"  ","  ","  "]
[null,null,null,null,null,null,null,null,null,null,null,null,null,"  ","  ","  ","  ",null,7,"Other",{"$f":"INDEX(Calculator!$D$6:$CM$36,MATCH($S227&U$2,Calculator!$A$6:$A$36,0),MATCH(U$1&$T227,Calculator!$D$2:$CM$2,0))","v":1},{"$f":"INDEX(Calculator!$D$6:$CM$36,MATCH($S227&V$2,Calculator!$A$6:$A$36,0),MATCH(V$1&$T227,Calculator!$D$2:$CM$2,0))","v":1},null,null,null,null,null,"  ","  ",{"$f":"INDEX(P227:V227,0, MATCH($AB$1,$P$1:$V$1,0))","v":"  "},null,"  ","  ","  "]
[null,null,null,null,null,null,null,null,null,null,null,null,null,"  ","  ","  ","  ",null,8,"Other",{"$f":"INDEX(Calculator!$D$6:$CM$36,MATCH($S228&U$2,Calculator!$A$6:$A$36,0),MATCH(U$1&$T228,Calculator!$D$2:$CM$2,0))","v":1},{"$f":"INDEX(Calculator!$D$6:$CM$36,MATCH($S228&V$2,Calculator!$A$6:$A$36,0),MATCH(V$1&$T228,Calculator!$D$2:$CM$2,0))","v":1},null,null,null,null,null,"  ","  ",{"$f":"INDEX(P228:V228,0, MATCH($AB$1,$P$1:$V$1,0))","v":"  "},null,"  ","  ","  "]
[null,null,null,null,null,null,null,null,null,null,null,null,null,"  ","  ","  ","  ",null,9,"Other",{"$f":"INDEX(Calculator!$D$6:$CM$36,MATCH($S229&U$2,Calculator!$A$6:$A$36,0),MATCH(U$1&$T229,Calculator!$D$2:$CM$2,0))","v":1},{"$f":"INDEX(Calculator!$D$6:$CM$36,MATCH($S229&V$2,Calculator!$A$6:$A$36,0),MATCH(V$1&$T229,Calculator!$D$2:$CM$2,0))","v":1},null,null,null,null,null,"  ","  ",{"$f":"INDEX(P229:V229,0, MATCH($AB$1,$P$1:$V$1,0))","v":"  "},null,"  ","  ","  "]
[null,null,null,null,null,null,null,null,null,null,null,null,null,"  ","  ","  ","  ",null,10,"Other",{"$f":"INDEX(Calculator!$D$6:$CM$36,MATCH($S230&U$2,Calculator!$A$6:$A$36,0),MATCH(U$1&$T230,Calculator!$D$2:$CM$2,0))","v":1},{"$f":"INDEX(Calculator!$D$6:$CM$36,MATCH($S230&V$2,Calculator!$A$6:$A$36,0),MATCH(V$1&$T230,Calculator!$D$2:$CM$2,0))","v":1},null,null,null,null,null,"  ","  ",{"$f":"INDEX(P230:V230,0, MATCH($AB$1,$P$1:$V$1,0))","v":"  "},null,"  ","  ","  "]
[null,null,null,null,null,null,null,null,null,null,null,null,null,"  ","  ","  ","  ",null,11,"Other",{"$f":"INDEX(Calculator!$D$6:$CM$36,MATCH($S231&U$2,Calculator!$A$6:$A$36,0),MATCH(U$1&$T231,Calculator!$D$2:$CM$2,0))","v":1},{"$f":"INDEX(Calculator!$D$6:$CM$36,MATCH($S231&V$2,Calculator!$A$6:$A$36,0),MATCH(V$1&$T231,Calculator!$D$2:$CM$2,0))","v":1},null,null,null,null,null,"  ","  ",{"$f":"INDEX(P231:V231,0, MATCH($AB$1,$P$1:$V$1,0))","v":"  "},null,"  ","  ","  "]
[null,null,null,null,null,null,null,null,null,null,null,null,null,"  ","  ","  ","  ",null,12,"Other",{"$f":"INDEX(Calculator!$D$6:$CM$36,MATCH($S232&U$2,Calculator!$A$6:$A$36,0),MATCH(U$1&$T232,Calculator!$D$2:$CM$2,0))","v":1},{"$f":"INDEX(Calculator!$D$6:$CM$36,MATCH($S232&V$2,Calculator!$A$6:$A$36,0),MATCH(V$1&$T232,Calculator!$D$2:$CM$2,0))","v":1},null,null,null,null,null,"  ","  ",{"$f":"INDEX(P232:V232,0, MATCH($AB$1,$P$1:$V$1,0))","v":"  "},null,"  ","  ","  "]
[null,null,null,null,null,null,null,null,null,null,null,null,null,"  ","  ","  ","  ",null,13,"Other",{"$f":"INDEX(Calculator!$D$6:$CM$36,MATCH($S233&U$2,Calculator!$A$6:$A$36,0),MATCH(U$1&$T233,Calculator!$D$2:$CM$2,0))","v":1},{"$f":"INDEX(Calculator!$D$6:$CM$36,MATCH($S233&V$2,Calculator!$A$6:$A$36,0),MATCH(V$1&$T233,Calculator!$D$2:$CM$2,0))","v":1},null,null,null,null,null,"  ","  ",{"$f":"INDEX(P233:V233,0, MATCH($AB$1,$P$1:$V$1,0))","v":"  "},null,"  ","  ","  "]
[null,null,null,null,null,null,null,null,null,null,null,null,null,"  ","  ","  ","  ",null,14,"Other",{"$f":"INDEX(Calculator!$D$6:$CM$36,MATCH($S234&U$2,Calculator!$A$6:$A$36,0),MATCH(U$1&$T234,Calculator!$D$2:$CM$2,0))","v":1},{"$f":"INDEX(Calculator!$D$6:$CM$36,MATCH($S234&V$2,Calculator!$A$6:$A$36,0),MATCH(V$1&$T234,Calculator!$D$2:$CM$2,0))","v":1},null,null,null,null,null,"  ","  ",{"$f":"INDEX(P234:V234,0, MATCH($AB$1,$P$1:$V$1,0))","v":"  "},null,"  ","  ","  "]
[null,null,null,null,null,null,null,null,null,null,null,null,null,"  ","  ","  ","  ",null,15,"Other",{"$f":"INDEX(Calculator!$D$6:$CM$36,MATCH($S235&U$2,Calculator!$A$6:$A$36,0),MATCH(U$1&$T235,Calculator!$D$2:$CM$2,0))","v":1},{"$f":"INDEX(Calculator!$D$6:$CM$36,MATCH($S235&V$2,Calculator!$A$6:$A$36,0),MATCH(V$1&$T235,Calculator!$D$2:$CM$2,0))","v":1},null,null,null,null,null,"  ",{"$f":"IF(OR($AB$1=\"FPI for v10\", $AB$1=\"FPI_SCC for v10\"), $T235, $O235)","v":"  "},{"$f":"INDEX(P235:V235,0, MATCH($AB$1,$P$1:$V$1,0))","v":"  "},null,"  ","  ","  "]
[null,null,null,null,null,null,null,null,null,null,null,null,null,"  ","  ","  ","  ",null,16,"Other",{"$f":"INDEX(Calculator!$D$6:$CM$36,MATCH($S236&U$2,Calculator!$A$6:$A$36,0),MATCH(U$1&$T236,Calculator!$D$2:$CM$2,0))","v":1},{"$f":"INDEX(Calculator!$D$6:$CM$36,MATCH($S236&V$2,Calculator!$A$6:$A$36,0),MATCH(V$1&$T236,Calculator!$D$2:$CM$2,0))","v":1},null,null,null,null,null,{"$f":"IF(OR($AB$1=\"FPI for v10\", $AB$1=\"FPI_SCC for v10\"), $S236, $N236)","v":"  "},"  ",{"$f":"INDEX(P236:V236,0, MATCH($AB$1,$P$1:$V$1,0))","v":"  "},null,"  ","  ","  "]
[null,null,null,null,null,null,null,null,null,null,null,null,null,"  ","  ","  ","  ",null,17,"Other",{"$f":"INDEX(Calculator!$D$6:$CM$36,MATCH($S237&U$2,Calculator!$A$6:$A$36,0),MATCH(U$1&$T237,Calculator!$D$2:$CM$2,0))","v":1},{"$f":"INDEX(Calculator!$D$6:$CM$36,MATCH($S237&V$2,Calculator!$A$6:$A$36,0),MATCH(V$1&$T237,Calculator!$D$2:$CM$2,0))","v":1},null,null,null,null,null,"  ","  ",{"$f":"INDEX(P237:V237,0, MATCH($AB$1,$P$1:$V$1,0))","v":"  "},null,"  ","  ","  "]
[null,null,null,null,null,null,null,null,null,null,null,null,null,"  ","  ","  ","  ",null,18,"Other",{"$f":"INDEX(Calculator!$D$6:$CM$36,MATCH($S238&U$2,Calculator!$A$6:$A$36,0),MATCH(U$1&$T238,Calculator!$D$2:$CM$2,0))","v":1},{"$f":"INDEX(Calculator!$D$6:$CM$36,MATCH($S238&V$2,Calculator!$A$6:$A$36,0),MATCH(V$1&$T238,Calculator!$D$2:$CM$2,0))","v":1},null,null,null,null,null,"  ","  ",{"$f":"INDEX(P238:V238,0, MATCH($AB$1,$P$1:$V$1,0))","v":"  "},null,"  ","  ","  "]
[null,null,null,null,null,null,null,null,null,null,null,null,null,"  ","  ","  ","  ",null,19,"Other",{"$f":"INDEX(Calculator!$D$6:$CM$36,MATCH($S239&U$2,Calculator!$A$6:$A$36,0),MATCH(U$1&$T239,Calculator!$D$2:$CM$2,0))","v":1},{"$f":"INDEX(Calculator!$D$6:$CM$36,MATCH($S239&V$2,Calculator!$A$6:$A$36,0),MATCH(V$1&$T239,Calculator!$D$2:$CM$2,0))","v":1},null,null,null,null,null,"  ","  ",{"$f":"INDEX(P239:V239,0, MATCH($AB$1,$P$1:$V$1,0))","v":"  "},null,"  ","  ","  "]
[null,null,null,null,null,null,null,null,null,null,null,null,null,"  ","  ","  ","  ",null,20,"Other",{"$f":"INDEX(Calculator!$D$6:$CM$36,MATCH($S240&U$2,Calculator!$A$6:$A$36,0),MATCH(U$1&$T240,Calculator!$D$2:$CM$2,0))","v":1},{"$f":"INDEX(Calculator!$D$6:$CM$36,MATCH($S240&V$2,Calculator!$A$6:$A$36,0),MATCH(V$1&$T240,Calculator!$D$2:$CM$2,0))","v":1},null,null,null,null,null,"  ","  ",{"$f":"INDEX(P240:V240,0, MATCH($AB$1,$P$1:$V$1,0))","v":"  "},null,"  ","  ","  "]
[null,null,null,null,null,null,null,null,null,null,null,null,null,"  ","  ","  ","  ",null,21,"Other",{"$f":"INDEX(Calculator!$D$6:$CM$36,MATCH($S241&U$2,Calculator!$A$6:$A$36,0),MATCH(U$1&$T241,Calculator!$D$2:$CM$2,0))","v":1},{"$f":"INDEX(Calculator!$D$6:$CM$36,MATCH($S241&V$2,Calculator!$A$6:$A$36,0),MATCH(V$1&$T241,Calculator!$D$2:$CM$2,0))","v":1},null,null,null,null,null,"  ","  ",{"$f":"INDEX(P241:V241,0, MATCH($AB$1,$P$1:$V$1,0))","v":"  "},null,"  ","  ","  "]
[null,null,null,null,null,null,null,null,null,null,null,null,null,"  ","  ","  ","  ",null,22,"Other",{"$f":"INDEX(Calculator!$D$6:$CM$36,MATCH($S242&U$2,Calculator!$A$6:$A$36,0),MATCH(U$1&$T242,Calculator!$D$2:$CM$2,0))","v":1},{"$f":"INDEX(Calculator!$D$6:$CM$36,MATCH($S242&V$2,Calculator!$A$6:$A$36,0),MATCH(V$1&$T242,Calculator!$D$2:$CM$2,0))","v":1},null,null,null,null,null,"  ","  ",{"$f":"INDEX(P242:V242,0, MATCH($AB$1,$P$1:$V$1,0))","v":"  "},null,"  ","  ","  "]
[null,null,null,null,null,null,null,null,null,null,null,null,null,"  ","  ","  ","  ",null,23,"Other",{"$f":"INDEX(Calculator!$D$6:$CM$36,MATCH($S243&U$2,Calculator!$A$6:$A$36,0),MATCH(U$1&$T243,Calculator!$D$2:$CM$2,0))","v":1},{"$f":"INDEX(Calculator!$D$6:$CM$36,MATCH($S243&V$2,Calculator!$A$6:$A$36,0),MATCH(V$1&$T243,Calculator!$D$2:$CM$2,0))","v":1},null,null,null,null,null,"  ","  ",{"$f":"INDEX(P243:V243,0, MATCH($AB$1,$P$1:$V$1,0))","v":"  "},null,"  ","  ","  "]
[null,null,null,null,null,null,null,null,null,null,null,null,null,"  ","  ","  ","  ",null,24,"Other",{"$f":"INDEX(Calculator!$D$6:$CM$36,MATCH($S244&U$2,Calculator!$A$6:$A$36,0),MATCH(U$1&$T244,Calculator!$D$2:$CM$2,0))","v":1},{"$f":"INDEX(Calculator!$D$6:$CM$36,MATCH($S244&V$2,Calculator!$A$6:$A$36,0),MATCH(V$1&$T244,Calculator!$D$2:$CM$2,0))","v":1},null,null,null,null,null,"  ","  ",{"$f":"INDEX(P244:V244,0, MATCH($AB$1,$P$1:$V$1,0))","v":"  "},null,"  ","  ","  "]
[null,null,null,null,null,null,null,null,null,null,null,null,null,"  ","  ","  ","  ",null,25,"Other",{"$f":"INDEX(Calculator!$D$6:$CM$36,MATCH($S245&U$2,Calculator!$A$6:$A$36,0),MATCH(U$1&$T245,Calculator!$D$2:$CM$2,0))","v":1},{"$f":"INDEX(Calculator!$D$6:$CM$36,MATCH($S245&V$2,Calculator!$A$6:$A$36,0),MATCH(V$1&$T245,Calculator!$D$2:$CM$2,0))","v":1},null,null,null,null,null,"  ","  ",{"$f":"INDEX(P245:V245,0, MATCH($AB$1,$P$1:$V$1,0))","v":"  "},null,"  ","  ","  "]
[null,null,null,null,null,null,null,null,null,null,null,null,null,"  ","  ","  ","  ",null,26,"Other",{"$f":"INDEX(Calculator!$D$6:$CM$36,MATCH($S246&U$2,Calculator!$A$6:$A$36,0),MATCH(U$1&$T246,Calculator!$D$2:$CM$2,0))","v":1},{"$f":"INDEX(Calculator!$D$6:$CM$36,MATCH($S246&V$2,Calculator!$A$6:$A$36,0),MATCH(V$1&$T246,Calculator!$D$2:$CM$2,0))","v":1},null,null,null,null,null,"  ","  ",{"$f":"INDEX(P246:V246,0, MATCH($AB$1,$P$1:$V$1,0))","v":"  "},null,"  ","  ","  "]
[null,null,null,null,null,null,null,null,null,null,null,null,null,"  ","  ","  ","  ",null,27,"Other",{"$f":"INDEX(Calculator!$D$6:$CM$36,MATCH($S247&U$2,Calculator!$A$6:$A$36,0),MATCH(U$1&$T247,Calculator!$D$2:$CM$2,0))","v":1},{"$f":"INDEX(Calculator!$D$6:$CM$36,MATCH($S247&V$2,Calculator!$A$6:$A$36,0),MATCH(V$1&$T247,Calculator!$D$2:$CM$2,0))","v":1},null,null,null,null,null,"  ","  ",{"$f":"INDEX(P247:V247,0, MATCH($AB$1,$P$1:$V$1,0))","v":"  "},null,"  ","  ","  "]
[null,null,null,null,null,null,null,null,null,null,null,null,null,"  ","  ","  ","  ",null,28,"Other",{"$f":"INDEX(Calculator!$D$6:$CM$36,MATCH($S248&U$2,Calculator!$A$6:$A$36,0),MATCH(U$1&$T248,Calculator!$D$2:$CM$2,0))","v":1},{"$f":"INDEX(Calculator!$D$6:$CM$36,MATCH($S248&V$2,Calculator!$A$6:$A$36,0),MATCH(V$1&$T248,Calculator!$D$2:$CM$2,0))","v":1},null,null,null,null,null,"  ","  ",{"$f":"INDEX(P248:V248,0, MATCH($AB$1,$P$1:$V$1,0))","v":"  "},null,"  ","  ","  "]
[null,null,null,null,null,null,null,null,null,null,null,null,null,"  ","  ","  ","  ",null,29,"Other",{"$f":"INDEX(Calculator!$D$6:$CM$36,MATCH($S249&U$2,Calculator!$A$6:$A$36,0),MATCH(U$1&$T249,Calculator!$D$2:$CM$2,0))","v":1},{"$f":"INDEX(Calculator!$D$6:$CM$36,MATCH($S249&V$2,Calculator!$A$6:$A$36,0),MATCH(V$1&$T249,Calculator!$D$2:$CM$2,0))","v":1},null,null,null,null,null,"  ","  ",{"$f":"INDEX(P249:V249,0, MATCH($AB$1,$P$1:$V$1,0))","v":"  "},null,"  ","  ","  "]
[null,null,null,null,null,null,null,null,null,null,null,null,null,"  ","  ","  ","  ",null,30,"Other",{"$f":"INDEX(Calculator!$D$6:$CM$36,MATCH($S250&U$2,Calculator!$A$6:$A$36,0),MATCH(U$1&$T250,Calculator!$D$2:$CM$2,0))","v":1},{"$f":"INDEX(Calculator!$D$6:$CM$36,MATCH($S250&V$2,Calculator!$A$6:$A$36,0),MATCH(V$1&$T250,Calculator!$D$2:$CM$2,0))","v":1},null,null,null,null,null,"  ","  ",{"$f":"INDEX(P250:V250,0, MATCH($AB$1,$P$1:$V$1,0))","v":"  "},null,"  ","  ","  "]

{"sheet":"Help enabling macros","index":2,"n_rows":0,"n_cols":0,"rows_kept":0,"cut":false,"hidden":false,"merged":[]}

{"sheet":"More information","index":3,"n_rows":24,"n_cols":2,"rows_kept":24,"cut":false,"hidden":false,"merged":[]}
[]
[]
[]
[]
[]
[]
[]
[]
[]
[]
[]
[]
[]
[]
[]
[]
[]
[]
[]
[null,"Extrapolated modified fuel prices = Fuel Price entered + (Fuel cost modifier * Heat content * 10) "]
[null,"Projected real FPIs from the Annula Supplement to National Institute of Standards and Technology (NIST) Handbook 135."]
[]
[]
[null,"The video demonstration of using the FPI calculator can be seen by clicking here ->"]

{"sheet":"Calculator","index":4,"n_rows":73,"n_cols":91,"rows_kept":73,"cut":false,"hidden":true,"merged":[[4,0,4,2],[2,83,2,90],[2,3,2,10],[2,35,2,42],[2,11,2,18],[2,19,2,26],[2,27,2,34],[2,75,2,82],[2,59,2,66],[2,67,2,74],[2,43,2,50],[2,51,2,58]]}
[null,null,null,"FPI for v10",{"$f":"D1","v":"FPI for v10"},{"$f":"E1","v":"FPI for v10"},"FPI for v10","FPI for v10","FPI for v10","FPI for v10","FPI for v10","UPV_v10","UPV_v10","UPV_v10","UPV_v10","UPV_v10","UPV_v10","UPV_v10","UPV_v10","FPI for v8.9 (adjusted for 30 yr UPV)","FPI for v8.9 (adjusted for 30 yr UPV)","FPI for v8.9 (adjusted for 30 yr UPV)","FPI for v8.9 (adjusted for 30 yr UPV)","FPI for v8.9 (adjusted for 30 yr UPV)","FPI for v8.9 (adjusted for 30 yr UPV)","FPI for v8.9 (adjusted for 30 yr UPV)","FPI for v8.9 (adjusted for 30 yr UPV)","UPV_v8","UPV_v8","UPV_v8","UPV_v8","UPV_v8","UPV_v8","UPV_v8","UPV_v8",{"$f":"INDEX('User Inputs_FPI_Calculator'!$F$11:$F$18,MATCH(Calculator!AJ$4,'User Inputs_FPI_Calculator'!$C$11:$C$18,0),1)","v":3.4129999999999998E-3},{"$f":"INDEX('User Inputs_FPI_Calculator'!$F$11:$F$18,MATCH(Calculator!AK$4,'User Inputs_FPI_Calculator'!$C$11:$C$18,0),1)","v":1.0369999999999999},{"$f":"INDEX('User Inputs_FPI_Calculator'!$F$11:$F$18,MATCH(Calculator!AL$4,'User Inputs_FPI_Calculator'!$C$11:$C$18,0),1)","v":9.1499999999999998E-2},{"$f":"INDEX('User Inputs_FPI_Calculator'!$F$11:$F$18,MATCH(Calculator!AM$4,'User Inputs_FPI_Calculator'!$C$11:$C$18,0),1)","v":0.13850000000000001},{"$f":"INDEX('User Inputs_FPI_Calculator'!$F$11:$F$18,MATCH(Calculator!AN$4,'User Inputs_FPI_Calculator'!$C$11:$C$18,0),1)","v":0.13189999999999999},{"$f":"INDEX('User Inputs_FPI_Calculator'!$F$11:$F$18,MATCH(Calculator!AO$4,'User Inputs_FPI_Calculator'!$C$11:$C$18,0),1)","v":20.2},{"$f":"INDEX('User Inputs_FPI_Calculator'!$F$11:$F$18,MATCH(Calculator!AP$4,'User Inputs_FPI_Calculator'!$C$11:$C$18,0),1)","v":21},{"$f":"INDEX('User Inputs_FPI_Calculator'!$F$11:$F$18,MATCH(Calculator!AQ$4,'User Inputs_FPI_Calculator'!$C$11:$C$18,0),1)","v":1},"<-- Heat Content (MMBtu/fuel unit); from WAv10",null,null,null,null,null,null,null,null,null,null,null,null,null,null,null,"FPI_SCC for v10","FPI_SCC for v10","FPI_SCC for v10","FPI_SCC for v10","FPI_SCC for v10","FPI_SCC for v10","FPI_SCC for v10","FPI_SCC for v10","UPV_SCC_v10","UPV_SCC_v10",{"$f":"BQ1","v":"UPV_SCC_v10"},"UPV_SCC_v10","UPV_SCC_v10","UPV_SCC_v10","UPV_SCC_v10","UPV_SCC_v10","FPI_SCC for v8.9 (adjusted for 30 year UPV)","FPI_SCC for v8.9 (adjusted for 30 year UPV)","FPI_SCC for v8.9 (adjusted for 30 year UPV)","FPI_SCC for v8.9 (adjusted for 30 year UPV)","FPI_SCC for v8.9 (adjusted for 30 year UPV)","FPI_SCC for v8.9 (adjusted for 30 year UPV)","FPI_SCC for v8.9 (adjusted for 30 year UPV)","FPI_SCC for v8.9 (adjusted for 30 year UPV)","UPV_SCC_v8","UPV_SCC_v8","UPV_SCC_v8","UPV_SCC_v8","UPV_SCC_v8","UPV_SCC_v8","UPV_SCC_v8","UPV_SCC_v8"]
[null,null,null,{"$f":"D1&D4","v":"FPI for v10Electricity"},"FPI for v10Natural Gas","FPI for v10Propane","FPI for v10Oil","FPI for v10Kerosene","FPI for v10Wood","FPI for v10Coal","FPI for v10Other","UPV_v10Electricity","UPV_v10Natural Gas","UPV_v10Propane","UPV_v10Oil","UPV_v10Kerosene","UPV_v10Wood","UPV_v10Coal","UPV_v10Other","FPI for v8.9 (adjusted for 30 yr UPV)Electricity","FPI for v8.9 (adjusted for 30 yr UPV)Natural Gas","FPI for v8.9 (adjusted for 30 yr UPV)Propane","FPI for v8.9 (adjusted for 30 yr UPV)Oil","FPI for v8.9 (adjusted for 30 yr UPV)Kerosene","FPI for v8.9 (adjusted for 30 yr UPV)Wood","FPI for v8.9 (adjusted for 30 yr UPV)Coal","FPI for v8.9 (adjusted for 30 yr UPV)Other","UPV_v8Electricity","UPV_v8Natural Gas","UPV_v8Propane","UPV_v8Oil","UPV_v8Kerosene","UPV_v8Wood","UPV_v8Coal","UPV_v8Other","kWh","Mcf","Gallon","Gallon","Gallon","Cord","Short Ton","MMBtu","kWh","therm","Gallon","Gallon","Gallon","Cord","Short Ton","MMBtu",{"$f":"AJ2","v":"kWh"},"Mcf","Gallon","Gallon","Gallon","Cord","Short Ton","MMBtu",{"$f":"BH1&BH4","v":"FPI_SCC for v10Electricity"},"FPI_SCC for v10Natural Gas","FPI_SCC for v10Propane","FPI_SCC for v10Oil","FPI_SCC for v10Kerosene","FPI_SCC for v10Wood","FPI_SCC for v10Coal","FPI_SCC for v10Other","UPV_SCC_v10Electricity","UPV_SCC_v10Natural Gas","UPV_SCC_v10Propane","UPV_SCC_v10Oil","UPV_SCC_v10Kerosene","UPV_SCC_v10Wood","UPV_SCC_v10Coal","UPV_SCC_v10Other","FPI_SCC for v8.9 (adjusted for 30 year UPV)Electricity","FPI_SCC for v8.9 (adjusted for 30 year UPV)Natural Gas","FPI_SCC for v8.9 (adjusted for 30 year UPV)Propane","FPI_SCC for v8.9 (adjusted for 30 year UPV)Oil","FPI_SCC for v8.9 (adjusted for 30 year UPV)Kerosene","FPI_SCC for v8.9 (adjusted for 30 year UPV)Wood","FPI_SCC for v8.9 (adjusted for 30 year UPV)Coal","FPI_SCC for v8.9 (adjusted for 30 year UPV)Other","UPV_SCC_v8Electricity","UPV_SCC_v8Natural Gas","UPV_SCC_v8Propane","UPV_SCC_v8Oil","UPV_SCC_v8Kerosene","UPV_SCC_v8Wood","UPV_SCC_v8Coal","UPV_SCC_v8Other"]
[null,null,null,"FPI (v10); from 2023 NIST",null,null,null,null,null,null,null,"UPV (v10)",null,null,null,null,null,null,null,"FPI (v8.9_30yEqv)",null,null,null,null,null,null,null,"UPV (v8.9_30yEqv)",null,null,null,null,null,null,null,"Projected Fuel Price = FPI * Base Year Fuel Price",null,null,null,null,null,null,null,"Fuel Price Modifier (2020$/fuel unit); from WPN 22-10",null,null,null,null,null,null,null,"Modified Fuel Price ($/fuel unit) = Projected + Modifier",null,null,null,null,null,null,null,"FPI_SCC (v10)",null,null,null,null,null,null,null,"UPV_SCC (v10)",null,null,null,null,null,null,null,"FPI_SCC (v8.9_30yEqv)",null,null,null,null,null,null,null,"UPV_SCC (v8.9_30yEqv)"]
["Discount Rate =",null,0.03,"Electricity","Natural Gas","Propane","Oil","Kerosene","Wood","Coal","Other",{"$f":"D4","v":"Electricity"},{"$f":"E4","v":"Natural Gas"},"Propane","Oil","Kerosene","Wood","Coal","Other","Electricity","Natural Gas","Propane","Oil","Kerosene","Wood","Coal","Other",{"$f":"T4","v":"Electricity"},"Natural Gas","Propane","Oil","Kerosene","Wood","Coal","Other","Electricity","Natural Gas","Propane","Oil","Kerosene","Wood","Coal","Other",{"$f":"AJ4","v":"Electricity"},"Natural Gas","Propane","Oil","Kerosene","Wood","Coal","Other","Electricity","Natural Gas","Propane","Oil","Kerosene","Wood","Coal","Other","Electricity","Natural Gas","Propane","Oil","Kerosene","Wood","Coal","Other","Electricity","Natural Gas","Propane","Oil","Kerosene","Wood","Coal","Other","Electricity",{"$f":"BQ4","v":"Natural Gas"},"Propane","Oil","Kerosene","Wood","Coal","Other","Electricity","Natural Gas","Propane","Oil","Kerosene","Wood","Coal","Other"]
[{"$f":"'User Inputs_FPI_Calculator'!$I$5","v":"Region 4 - West"},null,null,null,null,null,null,null,null,null,null,null,null,null,null,null,null,null,null,null,null,null,null,null,null,null,null,null,null,null,null,null,null,null,"2022 NIST Fuel Price ($/fuel unit) =",{"$f":"INDEX('User Inputs_FPI_Calculator'!$E$11:$E$18,MATCH(Calculator!AJ$4,'User Inputs_FPI_Calculator'!$C$11:$C$18,0),1)","v":0.15},{"$f":"INDEX('User Inputs_FPI_Calculator'!$E$11:$E$18,MATCH(Calculator!AK$4,'User Inputs_FPI_Calculator'!$C$11:$C$18,0),1)","v":15.37},{"$f":"INDEX('User Inputs_FPI_Calculator'!$E$11:$E$18,MATCH(Calculator!AL$4,'User Inputs_FPI_Calculator'!$C$11:$C$18,0),1)","v":2.39},{"$f":"INDEX('User Inputs_FPI_Calculator'!$E$11:$E$18,MATCH(Calculator!AM$4,'User Inputs_FPI_Calculator'!$C$11:$C$18,0),1)","v":3.58},{"$f":"INDEX('User Inputs_FPI_Calculator'!$E$11:$E$18,MATCH(Calculator!AN$4,'User Inputs_FPI_Calculator'!$C$11:$C$18,0),1)","v":3.44},{"$f":"INDEX('User Inputs_FPI_Calculator'!$E$11:$E$18,MATCH(Calculator!AO$4,'User Inputs_FPI_Calculator'!$C$11:$C$18,0),1)","v":280},{"$f":"INDEX('User Inputs_FPI_Calculator'!$E$11:$E$18,MATCH(Calculator!AP$4,'User Inputs_FPI_Calculator'!$C$11:$C$18,0),1)","v":56.32},{"$f":"INDEX('User Inputs_FPI_Calculator'!$E$11:$E$18,MATCH(Calculator!AQ$4,'User Inputs_FPI_Calculator'!$C$11:$C$18,0),1)","v":0},null,null,null,null,null,null,null,"Modified Fuel Price ($/fuel unit) =",{"$f":"AZ6","v":0.1699},{"$f":"BA6","v":18.277986509999998},2.69475,4.1200700000000001,3.98007,380.42228,56.32,0]
[{"$f":"C6&B6","v":"0Region 4 - West"},{"$f":"A5","v":"Region 4 - West"},0,{"$f":"INDEX('2023 NIST (for reference)'!$J$3:$N$250,MATCH(Calculator!$C6&D$4,'2023 NIST (for reference)'!$A$3:$A$250,0),MATCH(Calculator!$B6,'2023 NIST (for reference)'!$J$2:$N$2,0))","v":1},{"$f":"INDEX('2023 NIST (for reference)'!$J$3:$N$250,MATCH(Calculator!$C6&E$4,'2023 NIST (for reference)'!$A$3:$A$250,0),MATCH(Calculator!$B6,'2023 NIST (for reference)'!$J$2:$N$2,0))","v":1},{"$f":"INDEX('2023 NIST (for reference)'!$J$3:$N$250,MATCH(Calculator!$C6&F$4,'2023 NIST (for reference)'!$A$3:$A$250,0),MATCH(Calculator!$B6,'2023 NIST (for reference)'!$J$2:$N$2,0))","v":1},{"$f":"INDEX('2023 NIST (for reference)'!$J$3:$N$250,MATCH(Calculator!$C6&G$4,'2023 NIST (for reference)'!$A$3:$A$250,0),MATCH(Calculator!$B6,'2023 NIST (for reference)'!$J$2:$N$2,0))","v":1},{"$f":"INDEX('2023 NIST (for reference)'!$J$3:$N$250,MATCH(Calculator!$C6&H$4,'2023 NIST (for reference)'!$A$3:$A$250,0),MATCH(Calculator!$B6,'2023 NIST (for reference)'!$J$2:$N$2,0))","v":1},{"$f":"INDEX('2023 NIST (for reference)'!$J$3:$N$250,MATCH(Calculator!$C6&I$4,'2023 NIST (for reference)'!$A$3:$A$250,0),MATCH(Calculator!$B6,'2023 NIST (for reference)'!$J$2:$N$2,0))","v":1},{"$f":"INDEX('2023 NIST (for reference)'!$J$3:$N$250,MATCH(Calculator!$C6&J$4,'2023 NIST (for reference)'!$A$3:$A$250,0),MATCH(Calculator!$B6,'2023 NIST (for reference)'!$J$2:$N$2,0))","v":1},{"$f":"INDEX('2023 NIST (for reference)'!$J$3:$N$250,MATCH(Calculator!$C6&K$4,'2023 NIST (for reference)'!$A$3:$A$250,0),MATCH(Calculator!$B6,'2023 NIST (for reference)'!$J$2:$N$2,0))","v":1},{"$f":"D6/((1+$C$4)^$C6)","v":1},1,1,1,1,1,1,1,{"$f":"D6","v":1},{"$f":"E6","v":1},{"$f":"F6","v":1},{"$f":"G6","v":1},{"$f":"H6","v":1},{"$f":"I6","v":1},{"$f":"J6","v":1},{"$f":"K6","v":1},{"$f":"T6/((1+$C$4)^$C6)","v":1},1,1,1,1,1,1,1,{"$f":"AJ$5*D6","v":0.15},{"$f":"AK$5*E6","v":15.37},{"$f":"AL$5*F6","v":2.39},{"$f":"AM$5*G6","v":3.58},{"$f":"AN$5*H6","v":3.44},{"$f":"AO$5*I6","v":280},{"$f":"AP$5*J6","v":56.32},{"$f":"AQ$5*K6","v":0},1.9900000000000001E-2,0.28042299999999998,0.30474999999999997,0.54006999999999994,0.54006999999999994,100.42227999999999,0,0,{"$f":"AJ6+AR6","v":0.1699},{"$f":"AK6+AS6*($AK$1*10)","v":18.277986509999998},{"$f":"AL6+AT6","v":2.69475},{"$f":"AM6+AU6","v":4.1200700000000001},{"$f":"AN6+AV6","v":3.98007},{"$f":"AO6+AW6","v":380.42228},{"$f":"AP6+AX6","v":56.32},{"$f":"AQ6+AY6","v":0},{"$f":"IFERROR(AZ6/AZ$6,D6)","v":1},{"$f":"IFERROR(BA6/BA$6,E6)","v":1},{"$f":"IFERROR(BB6/BB$6,F6)","v":1},{"$f":"IFERROR(BC6/BC$6,G6)","v":1},{"$f":"IFERROR(BD6/BD$6,H6)","v":1},{"$f":"IFERROR(BE6/BE$6,I6)","v":1},{"$f":"IFERROR(BF6/BF$6,J6)","v":1},{"$f":"IFERROR(BG6/BG$6,K6)","v":1},{"$f":"BH6/((1+$C$4)^$C6)","v":1},1,1,1,1,1,1,1,{"$f":"BH6","v":1},{"$f":"BI6","v":1},{"$f":"BJ6","v":1},{"$f":"BK6","v":1},{"$f":"BL6","v":1},{"$f":"BM6","v":1},{"$f":"BN6","v":1},{"$f":"BO6","v":1},{"$f":"BX6/((1+$C$4)^$C6)","v":1},1,1,1,1,1,1,1]
["1Region 4 - West",{"$f":"B6","v":"Region 4 - West"},1,{"$f":"INDEX('2023 NIST (for reference)'!$J$3:$N$250,MATCH(Calculator!$C7&D$4,'2023 NIST (for reference)'!$A$3:$A$250,0),MATCH(Calculator!$B7,'2023 NIST (for reference)'!$J$2:$N$2,0))","v":0.9348597229818798},{"$f":"INDEX('2023 NIST (for reference)'!$J$3:$N$250,MATCH(Calculator!$C7&E$4,'2023 NIST (for reference)'!$A$3:$A$250,0),MATCH(Calculator!$B7,'2023 NIST (for reference)'!$J$2:$N$2,0))","v":0.98031290628534118},{"$f":"INDEX('2023 NIST (for reference)'!$J$3:$N$250,MATCH(Calculator!$C7&F$4,'2023 NIST (for reference)'!$A$3:$A$250,0),MATCH(Calculator!$B7,'2023 NIST (for reference)'!$J$2:$N$2,0))","v":1.0230244088275893},{"$f":"INDEX('2023 NIST (for reference)'!$J$3:$N$250,MATCH(Calculator!$C7&G$4,'2023 NIST (for reference)'!$A$3:$A$250,0),MATCH(Calculator!$B7,'2023 NIST (for reference)'!$J$2:$N$2,0))","v":0.9596828259813811},{"$f":"INDEX('2023 NIST (for reference)'!$J$3:$N$250,MATCH(Calculator!$C7&H$4,'2023 NIST (for reference)'!$A$3:$A$250,0),MATCH(Calculator!$B7,'2023 NIST (for reference)'!$J$2:$N$2,0))","v":0.9596828259813811},{"$f":"INDEX('2023 NIST (for reference)'!$J$3:$N$250,MATCH(Calculator!$C7&I$4,'2023 NIST (for reference)'!$A$3:$A$250,0),MATCH(Calculator!$B7,'2023 NIST (for reference)'!$J$2:$N$2,0))","v":1},{"$f":"INDEX('2023 NIST (for reference)'!$J$3:$N$250,MATCH(Calculator!$C7&J$4,'2023 NIST (for reference)'!$A$3:$A$250,0),MATCH(Calculator!$B7,'2023 NIST (for reference)'!$J$2:$N$2,0))","v":0.99958037539727507},{"$f":"INDEX('2023 NIST (for reference)'!$J$3:$N$250,MATCH(Calculator!$C7&K$4,'2023 NIST (for reference)'!$A$3:$A$250,0),MATCH(Calculator!$B7,'2023 NIST (for reference)'!$J$2:$N$2,0))","v":1},0.90763079901153376,0.95176010318965165,0.99322758138600897,0.93173089901104955,0.93173089901104955,0.970873786407767,0.9704663838808496,0.970873786407767,{"$f":"D7","v":0.9348597229818798},0.98031290628534118,1.0230244088275893,0.9596828259813811,0.9596828259813811,1,0.99958037539727507,1,0.90763079901153376,0.95176010318965165,0.99322758138600897,0.93173089901104955,0.93173089901104955,0.970873786407767,0.9704663838808496,0.970873786407767,0.14022895844728198,15.067409369605693,2.4450283370979387,3.4356645170133446,3.3013089213759508,280,56.296366742374531,0,1.95E-2,0.28571399999999997,0.3105,0.55025999999999997,0.55025999999999997,102.31703999999999,0,0,0.15972895844728197,{"$f":"AK7+AS7*($AK$1*10)","v":18.030263549605692},2.7555283370979389,3.9859245170133448,3.851568921375951,382.31704000000002,56.296366742374531,0,{"$f":"IFERROR(AZ7/AZ$6,D7)","v":0.94013512917764552},0.98644692290046421,1.0225543509037718,0.96744096993821582,0.96771386467472953,1.0049806756849258,0.99958037539727507,1,0.91275255259965582,0.95771545912666423,0.99277121446968131,0.93926307760991823,0.93952802395604806,0.97570939386885991,0.9704663838808496,0.970873786407767,{"$f":"BH7","v":0.94013512917764552},0.98644692290046421,1.0225543509037718,0.96744096993821582,0.96771386467472953,1.0049806756849258,0.99958037539727507,1,0.91275255259965582,0.95771545912666423,0.99277121446968131,0.93926307760991823,0.93952802395604806,0.97570939386885991,0.9704663838808496,0.970873786407767]
["2Region 4 - West","Region 4 - West",2,{"$f":"INDEX('2023 NIST (for reference)'!$J$3:$N$250,MATCH(Calculator!$C8&D$4,'2023 NIST (for reference)'!$A$3:$A$250,0),MATCH(Calculator!$B8,'2023 NIST (for reference)'!$J$2:$N$2,0))","v":0.86722030620246682},{"$f":"INDEX('2023 NIST (for reference)'!$J$3:$N$250,MATCH(Calculator!$C8&E$4,'2023 NIST (for reference)'!$A$3:$A$250,0),MATCH(Calculator!$B8,'2023 NIST (for reference)'!$J$2:$N$2,0))","v":0.91127274490115895},{"$f":"INDEX('2023 NIST (for reference)'!$J$3:$N$250,MATCH(Calculator!$C8&F$4,'2023 NIST (for reference)'!$A$3:$A$250,0),MATCH(Calculator!$B8,'2023 NIST (for reference)'!$J$2:$N$2,0))","v":0.9984701685970151},{"$f":"INDEX('2023 NIST (for reference)'!$J$3:$N$250,MATCH(Calculator!$C8&G$4,'2023 NIST (for reference)'!$A$3:$A$250,0),MATCH(Calculator!$B8,'2023 NIST (for reference)'!$J$2:$N$2,0))","v":0.91330895166801818},{"$f":"INDEX('2023 NIST (for reference)'!$J$3:$N$250,MATCH(Calculator!$C8&H$4,'2023 NIST (for reference)'!$A$3:$A$250,0),MATCH(Calculator!$B8,'2023 NIST (for reference)'!$J$2:$N$2,0))","v":0.91330895166801818},{"$f":"INDEX('2023 NIST (for reference)'!$J$3:$N$250,MATCH(Calculator!$C8&I$4,'2023 NIST (for reference)'!$A$3:$A$250,0),MATCH(Calculator!$B8,'2023 NIST (for reference)'!$J$2:$N$2,0))","v":1},{"$f":"INDEX('2023 NIST (for reference)'!$J$3:$N$250,MATCH(Calculator!$C8&J$4,'2023 NIST (for reference)'!$A$3:$A$250,0),MATCH(Calculator!$B8,'2023 NIST (for reference)'!$J$2:$N$2,0))","v":1.0154324603239135},{"$f":"INDEX('2023 NIST (for reference)'!$J$3:$N$250,MATCH(Calculator!$C8&K$4,'2023 NIST (for reference)'!$A$3:$A$250,0),MATCH(Calculator!$B8,'2023 NIST (for reference)'!$J$2:$N$2,0))","v":1},{"$f":"L7+D8/((1+$C$4)^$C8)","v":1.7250691119557009},{"$f":"M7+E8/((1+$C$4)^$C8)","v":1.8107220646385715},{"$f":"N7+F8/((1+$C$4)^$C8)","v":1.9343814776976456},{"$f":"O7+G8/((1+$C$4)^$C8)","v":1.7926121806285613},{"$f":"P7+H8/((1+$C$4)^$C8)","v":1.7926121806285613},{"$f":"Q7+I8/((1+$C$4)^$C8)","v":1.9134696955415214},{"$f":"R7+J8/((1+$C$4)^$C8)","v":1.9276088669837939},{"$f":"S7+K8/((1+$C$4)^$C8)","v":1.9134696955415214},0.86722030620246682,0.91127274490115895,0.9984701685970151,0.91330895166801818,0.91330895166801818,1,1.0154324603239135,1,{"$f":"AB7+T8/((1+$C$4)^$C8)","v":1.7250691119557009},{"$f":"AC7+U8/((1+$C$4)^$C8)","v":1.8107220646385715},{"$f":"AD7+V8/((1+$C$4)^$C8)","v":1.9343814776976456},{"$f":"AE7+W8/((1+$C$4)^$C8)","v":1.7926121806285613},{"$f":"AF7+X8/((1+$C$4)^$C8)","v":1.7926121806285613},{"$f":"AG7+Y8/((1+$C$4)^$C8)","v":1.9134696955415214},{"$f":"AH7+Z8/((1+$C$4)^$C8)","v":1.9276088669837939},{"$f":"AI7+AA8/((1+$C$4)^$C8)","v":1.9134696955415214},0.13008304593037001,14.006262089130812,2.3863437029468662,3.2696460469715052,3.1417827937379825,280,57.18915616544281,0,1.7999999999999999E-2,0.29100499999999996,0.31624999999999998,0.56045,0.56045,104.21179999999998,0,0,0.14808304593037,17.023983939130812,2.7025937029468663,3.8300960469715051,3.7022327937379824,384.21179999999998,57.18915616544281,0,0.87158944043772812,0.93139274010388873,1.0029107349278659,0.9296191683567282,0.93019288448142434,1.0099613513698513,1.0154324603239135,1,{"$f":"BP7+BH8/((1+$C$4)^$C8)","v":1.7343091936004364},{"$f":"BQ7+BI8/((1+$C$4)^$C8)","v":1.8356424457454679},{"$f":"BR7+BJ8/((1+$C$4)^$C8)","v":1.9381107704390148},{"$f":"BS7+BK8/((1+$C$4)^$C8)","v":1.8155183027552932},{"$f":"BT7+BL8/((1+$C$4)^$C8)","v":1.8163240315735656},{"$f":"BU7+BM8/((1+$C$4)^$C8)","v":1.9276948320532801},{"$f":"BV7+BN8/((1+$C$4)^$C8)","v":1.9276088669837939},{"$f":"BW7+BO8/((1+$C$4)^$C8)","v":1.9134696955415214},0.87158944043772812,0.93139274010388873,1.0029107349278659,0.9296191683567282,0.93019288448142434,1.0099613513698513,1.0154324603239135,1,{"$f":"CF7+BX8/((1+$C$4)^$C8)","v":1.7343091936004364},{"$f":"CG7+BY8/((1+$C$4)^$C8)","v":1.8356424457454679},{"$f":"CH7+BZ8/((1+$C$4)^$C8)","v":1.9381107704390148},{"$f":"CI7+CA8/((1+$C$4)^$C8)","v":1.8155183027552932},{"$f":"CJ7+CB8/((1+$C$4)^$C8)","v":1.8163240315735656},{"$f":"CK7+CC8/((1+$C$4)^$C8)","v":1.9276948320532801},{"$f":"CL7+CD8/((1+$C$4)^$C8)","v":1.9276088669837939},{"$f":"CM7+CE8/((1+$C$4)^$C8)","v":1.9134696955415214}]
["3Region 4 - West","Region 4 - West",3,{"$f":"INDEX('2023 NIST (for reference)'!$J$3:$N$250,MATCH(Calculator!$C9&D$4,'2023 NIST (for reference)'!$A$3:$A$250,0),MATCH(Calculator!$B9,'2023 NIST (for reference)'!$J$2:$N$2,0))","v":0.84483048522146464},{"$f":"INDEX('2023 NIST (for reference)'!$J$3:$N$250,MATCH(Calculator!$C9&E$4,'2023 NIST (for reference)'!$A$3:$A$250,0),MATCH(Calculator!$B9,'2023 NIST (for reference)'!$J$2:$N$2,0))","v":0.83484140401895668},{"$f":"INDEX('2023 NIST (for reference)'!$J$3:$N$250,MATCH(Calculator!$C9&F$4,'2023 NIST (for reference)'!$A$3:$A$250,0),MATCH(Calculator!$B9,'2023 NIST (for reference)'!$J$2:$N$2,0))","v":0.96304835584401083},{"$f":"INDEX('2023 NIST (for reference)'!$J$3:$N$250,MATCH(Calculator!$C9&G$4,'2023 NIST (for reference)'!$A$3:$A$250,0),MATCH(Calculator!$B9,'2023 NIST (for reference)'!$J$2:$N$2,0))","v":0.88964723820021419},{"$f":"INDEX('2023 NIST (for reference)'!$J$3:$N$250,MATCH(Calculator!$C9&H$4,'2023 NIST (for reference)'!$A$3:$A$250,0),MATCH(Calculator!$B9,'2023 NIST (for reference)'!$J$2:$N$2,0))","v":0.88964723820021419},{"$f":"INDEX('2023 NIST (for reference)'!$J$3:$N$250,MATCH(Calculator!$C9&I$4,'2023 NIST (for reference)'!$A$3:$A$250,0),MATCH(Calculator!$B9,'2023 NIST (for reference)'!$J$2:$N$2,0))","v":1},{"$f":"INDEX('2023 NIST (for reference)'!$J$3:$N$250,MATCH(Calculator!$C9&J$4,'2023 NIST (for reference)'!$A$3:$A$250,0),MATCH(Calculator!$B9,'2023 NIST (for reference)'!$J$2:$N$2,0))","v":1.0230917597032092},{"$f":"INDEX('2023 NIST (for reference)'!$J$3:$N$250,MATCH(Calculator!$C9&K$4,'2023 NIST (for reference)'!$A$3:$A$250,0),MATCH(Calculator!$B9,'2023 NIST (for reference)'!$J$2:$N$2,0))","v":1},2.4982086840734068,2.574720212409201,2.8157071481020655,2.6067654304340611,2.6067654304340611,2.8286113548946812,2.8638827576291326,2.8286113548946812,0.84483048522146464,0.83484140401895668,0.96304835584401083,0.88964723820021419,0.88964723820021419,1,1.0230917597032092,1,2.4982086840734068,2.574720212409201,2.8157071481020655,2.6067654304340611,2.6067654304340611,2.8286113548946812,2.8638827576291326,2.8286113548946812,0.12672457278321969,12.831512379771363,2.3016855704671859,3.1849371127567667,3.0603864994087369,280,57.620527906484746,0,1.7600000000000001E-2,0.296296,0.32200000000000001,0.57064000000000004,0.57064000000000004,106.10655999999999,0,0,0.1443245727832197,15.904101899771362,2.623685570467186,3.7555771127567668,3.6310264994087369,386.10656,57.620527906484746,0,0.84946776211430075,0.87012329782988573,0.97362856311983892,0.9115323557019096,0.91230217041628336,1.0149420270547771,1.0230917597032092,1,2.5116925309887326,2.631928524363353,2.8291188292861369,2.6496995353064334,2.651209753639812,2.856510562839448,2.8638827576291326,2.8286113548946812,0.84946776211430075,0.87012329782988573,0.97362856311983892,0.9115323557019096,0.91230217041628336,1.0149420270547771,1.0230917597032092,1,2.5116925309887326,2.631928524363353,2.8291188292861369,2.6496995353064334,2.651209753639812,2.856510562839448,2.8638827576291326,2.8286113548946812]
["4Region 4 - West","Region 4 - West",4,{"$f":"INDEX('2023 NIST (for reference)'!$J$3:$N$250,MATCH(Calculator!$C10&D$4,'2023 NIST (for reference)'!$A$3:$A$250,0),MATCH(Calculator!$B10,'2023 NIST (for reference)'!$J$2:$N$2,0))","v":0.83991193264594588},{"$f":"INDEX('2023 NIST (for reference)'!$J$3:$N$250,MATCH(Calculator!$C10&E$4,'2023 NIST (for reference)'!$A$3:$A$250,0),MATCH(Calculator!$B10,'2023 NIST (for reference)'!$J$2:$N$2,0))","v":0.77109079382382839},{"$f":"INDEX('2023 NIST (for reference)'!$J$3:$N$250,MATCH(Calculator!$C10&F$4,'2023 NIST (for reference)'!$A$3:$A$250,0),MATCH(Calculator!$B10,'2023 NIST (for reference)'!$J$2:$N$2,0))","v":0.9326200316050387},{"$f":"INDEX('2023 NIST (for reference)'!$J$3:$N$250,MATCH(Calculator!$C10&G$4,'2023 NIST (for reference)'!$A$3:$A$250,0),MATCH(Calculator!$B10,'2023 NIST (for reference)'!$J$2:$N$2,0))","v":0.87526585386183964},{"$f":"INDEX('2023 NIST (for reference)'!$J$3:$N$250,MATCH(Calculator!$C10&H$4,'2023 NIST (for reference)'!$A$3:$A$250,0),MATCH(Calculator!$B10,'2023 NIST (for reference)'!$J$2:$N$2,0))","v":0.87526585386183964},{"$f":"INDEX('2023 NIST (for reference)'!$J$3:$N$250,MATCH(Calculator!$C10&I$4,'2023 NIST (for reference)'!$A$3:$A$250,0),MATCH(Calculator!$B10,'2023 NIST (for reference)'!$J$2:$N$2,0))","v":1},{"$f":"INDEX('2023 NIST (for reference)'!$J$3:$N$250,MATCH(Calculator!$C10&J$4,'2023 NIST (for reference)'!$A$3:$A$250,0),MATCH(Calculator!$B10,'2023 NIST (for reference)'!$J$2:$N$2,0))","v":1.0199693294193084},{"$f":"INDEX('2023 NIST (for reference)'!$J$3:$N$250,MATCH(Calculator!$C10&K$4,'2023 NIST (for reference)'!$A$3:$A$250,0),MATCH(Calculator!$B10,'2023 NIST (for reference)'!$J$2:$N$2,0))","v":1},3.2444595576191642,3.2598243954886996,3.6443279668098629,3.3844278050731718,3.3844278050731718,3.71709840281037,3.7701122960894389,3.71709840281037,0.83991193264594588,0.77109079382382839,0.9326200316050387,0.87526585386183964,0.87526585386183964,1,1.0199693294193084,1,3.2444595576191642,3.2598243954886996,3.6443279668098629,3.3844278050731718,3.3844278050731718,3.71709840281037,3.7701122960894389,3.71709840281037,0.12598678989689188,11.851665501072242,2.2289618755360427,3.1334517568253859,3.0109145372847284,280,57.444672632895447,0,1.7600000000000001E-2,0.30158699999999999,0.32774999999999999,0.58082999999999996,0.58082999999999996,108.00131999999999,0,0,0.14358678989689189,14.979122691072241,2.5567118755360427,3.7142817568253861,3.5917445372847281,388.00131999999996,57.444672632895447,0,0.84512530839842193,0.81951711053496357,0.94877516487096869,0.90150938135162406,0.9024325042737259,1.0199227027397026,1.0199693294193084,1,3.2625754213664826,3.360058862618958,3.672093274658065,3.4506789442118371,3.4530093453051371,3.7626986740988371,3.7701122960894389,3.71709840281037,0.84512530839842193,0.81951711053496357,0.94877516487096869,0.90150938135162406,0.9024325042737259,1.0199227027397026,1.0199693294193084,1,3.2625754213664826,3.360058862618958,3.672093274658065,3.4506789442118371,3.4530093453051371,3.7626986740988371,3.7701122960894389,3.71709840281037]
["5Region 4 - West","Region 4 - West",5,{"$f":"INDEX('2023 NIST (for reference)'!$J$3:$N$250,MATCH(Calculator!$C11&D$4,'2023 NIST (for reference)'!$A$3:$A$250,0),MATCH(Calculator!$B11,'2023 NIST (for reference)'!$J$2:$N$2,0))","v":0.83783409529617092},{"$f":"INDEX('2023 NIST (for reference)'!$J$3:$N$250,MATCH(Calculator!$C11&E$4,'2023 NIST (for reference)'!$A$3:$A$250,0),MATCH(Calculator!$B11,'2023 NIST (for reference)'!$J$2:$N$2,0))","v":0.71793289757727208},{"$f":"INDEX('2023 NIST (for reference)'!$J$3:$N$250,MATCH(Calculator!$C11&F$4,'2023 NIST (for reference)'!$A$3:$A$250,0),MATCH(Calculator!$B11,'2023 NIST (for reference)'!$J$2:$N$2,0))","v":0.9131031703876481},{"$f":"INDEX('2023 NIST (for reference)'!$J$3:$N$250,MATCH(Calculator!$C11&G$4,'2023 NIST (for reference)'!$A$3:$A$250,0),MATCH(Calculator!$B11,'2023 NIST (for reference)'!$J$2:$N$2,0))","v":0.86232679786134725},{"$f":"INDEX('2023 NIST (for reference)'!$J$3:$N$250,MATCH(Calculator!$C11&H$4,'2023 NIST (for reference)'!$A$3:$A$250,0),MATCH(Calculator!$B11,'2023 NIST (for reference)'!$J$2:$N$2,0))","v":0.86232679786134725},{"$f":"INDEX('2023 NIST (for reference)'!$J$3:$N$250,MATCH(Calculator!$C11&I$4,'2023 NIST (for reference)'!$A$3:$A$250,0),MATCH(Calculator!$B11,'2023 NIST (for reference)'!$J$2:$N$2,0))","v":1},{"$f":"INDEX('2023 NIST (for reference)'!$J$3:$N$250,MATCH(Calculator!$C11&J$4,'2023 NIST (for reference)'!$A$3:$A$250,0),MATCH(Calculator!$B11,'2023 NIST (for reference)'!$J$2:$N$2,0))","v":1.0125766577111781},{"$f":"INDEX('2023 NIST (for reference)'!$J$3:$N$250,MATCH(Calculator!$C11&K$4,'2023 NIST (for reference)'!$A$3:$A$250,0),MATCH(Calculator!$B11,'2023 NIST (for reference)'!$J$2:$N$2,0))","v":1},3.9671826080782,3.8791196195372306,4.4319787826352783,4.1282784759182372,4.1282784759182372,4.5797071871945345,4.643569815893458,4.5797071871945345,0.83783409529617092,0.71793289757727208,0.9131031703876481,0.86232679786134725,0.86232679786134725,1,1.0125766577111781,1,3.9671826080782,3.8791196195372306,4.4319787826352783,4.1282784759182372,4.1282784759182372,4.5797071871945345,4.643569815893458,4.5797071871945345,0.12567511429442563,11.034628635762671,2.1823165772264792,3.0871299363436231,2.9664041846430345,280,57.028317362293549,0,1.7999999999999999E-2,0.31216899999999997,0.33925,0.60121000000000002,0.60121000000000002,111.79083999999999,0,0,0.14367511429442562,14.27182116576267,2.521566577226479,3.6883399363436231,3.5676141846430345,391.79084,57.028317362293549,0,0.84564516947866752,0.7808202045643523,0.93573302800871294,0.89521292996080726,0.89636970823202466,1.0298840541095542,1.0125766577111781,1,3.9920363730308166,4.0336012301008086,4.4792648044567738,4.2228974814903149,4.2262257296819516,4.6510857060709139,4.643569815893458,4.5797071871945345,0.84564516947866752,0.7808202045643523,0.93573302800871294,0.89521292996080726,0.89636970823202466,1.0298840541095542,1.0125766577111781,1,3.9920363730308166,4.0336012301008086,4.4792648044567738,4.2228974814903149,4.2262257296819516,4.6510857060709139,4.643569815893458,4.5797071871945345]
["6Region 4 - West","Region 4 - West",6,{"$f":"INDEX('2023 NIST (for reference)'!$J$3:$N$250,MATCH(Calculator!$C12&D$4,'2023 NIST (for reference)'!$A$3:$A$250,0),MATCH(Calculator!$B12,'2023 NIST (for reference)'!$J$2:$N$2,0))","v":0.83833743588948628},{"$f":"INDEX('2023 NIST (for reference)'!$J$3:$N$250,MATCH(Calculator!$C12&E$4,'2023 NIST (for reference)'!$A$3:$A$250,0),MATCH(Calculator!$B12,'2023 NIST (for reference)'!$J$2:$N$2,0))","v":0.70464145203382345},{"$f":"INDEX('2023 NIST (for reference)'!$J$3:$N$250,MATCH(Calculator!$C12&F$4,'2023 NIST (for reference)'!$A$3:$A$250,0),MATCH(Calculator!$B12,'2023 NIST (for reference)'!$J$2:$N$2,0))","v":0.9042516755187644},{"$f":"INDEX('2023 NIST (for reference)'!$J$3:$N$250,MATCH(Calculator!$C12&G$4,'2023 NIST (for reference)'!$A$3:$A$250,0),MATCH(Calculator!$B12,'2023 NIST (for reference)'!$J$2:$N$2,0))","v":0.86097861362888795},{"$f":"INDEX('2023 NIST (for reference)'!$J$3:$N$250,MATCH(Calculator!$C12&H$4,'2023 NIST (for reference)'!$A$3:$A$250,0),MATCH(Calculator!$B12,'2023 NIST (for reference)'!$J$2:$N$2,0))","v":0.86097861362888795},{"$f":"INDEX('2023 NIST (for reference)'!$J$3:$N$250,MATCH(Calculator!$C12&I$4,'2023 NIST (for reference)'!$A$3:$A$250,0),MATCH(Calculator!$B12,'2023 NIST (for reference)'!$J$2:$N$2,0))","v":1},{"$f":"INDEX('2023 NIST (for reference)'!$J$3:$N$250,MATCH(Calculator!$C12&J$4,'2023 NIST (for reference)'!$A$3:$A$250,0),MATCH(Calculator!$B12,'2023 NIST (for reference)'!$J$2:$N$2,0))","v":1.0072756330471637},{"$f":"INDEX('2023 NIST (for reference)'!$J$3:$N$250,MATCH(Calculator!$C12&K$4,'2023 NIST (for reference)'!$A$3:$A$250,0),MATCH(Calculator!$B12,'2023 NIST (for reference)'!$J$2:$N$2,0))","v":1},4.6692770124241871,4.4692457422222684,5.1892753249620593,4.8493345101737493,4.8493345101737493,5.4171914438781892,5.487147300711519,5.4171914438781892,0.83833743588948628,0.70464145203382345,0.9042516755187644,0.86097861362888795,0.86097861362888795,1,1.0072756330471637,1,4.6692770124241871,4.4692457422222684,5.1892753249620593,4.8493345101737493,4.8493345101737493,5.4171914438781892,5.487147300711519,5.4171914438781892,0.12575061538342294,10.830339117759866,2.1611615044898471,3.082303436791419,2.9617664308833747,280,56.72976365321626,0,1.8200000000000001E-2,0.31745999999999996,0.34499999999999997,0.61139999999999994,0.61139999999999994,113.68559999999998,0,0,0.14395061538342294,14.122399317759866,2.5061615044898469,3.6937034367914192,3.5731664308833748,393.68559999999997,56.72976365321626,0,0.84726671797188313,0.77264524240858889,0.93001632971141923,0.89651472833991153,0.8977647204404382,1.03486472979448,1.0072756330471637,1,4.7016089105442989,4.6806794566195276,5.2581388390488026,4.9737144523600136,4.9780895492568211,5.5177686250709748,5.487147300711519,5.4171914438781892,0.84726671797188313,0.77264524240858889,0.93001632971141923,0.89651472833991153,0.8977647204404382,1.03486472979448,1.0072756330471637,1,4.7016089105442989,4.6806794566195276,5.2581388390488026,4.9737144523600136,4.9780895492568211,5.5177686250709748,5.487147300711519,5.4171914438781892]
["7Region 4 - West","Region 4 - West",7,{"$f":"INDEX('2023 NIST (for reference)'!$J$3:$N$250,MATCH(Calculator!$C13&D$4,'2023 NIST (for reference)'!$A$3:$A$250,0),MATCH(Calculator!$B13,'2023 NIST (for reference)'!$J$2:$N$2,0))","v":0.84362183838221783},{"$f":"INDEX('2023 NIST (for reference)'!$J$3:$N$250,MATCH(Calculator!$C13&E$4,'2023 NIST (for reference)'!$A$3:$A$250,0),MATCH(Calculator!$B13,'2023 NIST (for reference)'!$J$2:$N$2,0))","v":0.70591713964079483},{"$f":"INDEX('2023 NIST (for reference)'!$J$3:$N$250,MATCH(Calculator!$C13&F$4,'2023 NIST (for reference)'!$A$3:$A$250,0),MATCH(Calculator!$B13,'2023 NIST (for reference)'!$J$2:$N$2,0))","v":0.90472467163879389},{"$f":"INDEX('2023 NIST (for reference)'!$J$3:$N$250,MATCH(Calculator!$C13&G$4,'2023 NIST (for reference)'!$A$3:$A$250,0),MATCH(Calculator!$B13,'2023 NIST (for reference)'!$J$2:$N$2,0))","v":0.86205559858561076},{"$f":"INDEX('2023 NIST (for reference)'!$J$3:$N$250,MATCH(Calculator!$C13&H$4,'2023 NIST (for reference)'!$A$3:$A$250,0),MATCH(Calculator!$B13,'2023 NIST (for reference)'!$J$2:$N$2,0))","v":0.86205559858561076},{"$f":"INDEX('2023 NIST (for reference)'!$J$3:$N$250,MATCH(Calculator!$C13&I$4,'2023 NIST (for reference)'!$A$3:$A$250,0),MATCH(Calculator!$B13,'2023 NIST (for reference)'!$J$2:$N$2,0))","v":1},{"$f":"INDEX('2023 NIST (for reference)'!$J$3:$N$250,MATCH(Calculator!$C13&J$4,'2023 NIST (for reference)'!$A$3:$A$250,0),MATCH(Calculator!$B13,'2023 NIST (for reference)'!$J$2:$N$2,0))","v":1.0031508877058128},{"$f":"INDEX('2023 NIST (for reference)'!$J$3:$N$250,MATCH(Calculator!$C13&K$4,'2023 NIST (for reference)'!$A$3:$A$250,0),MATCH(Calculator!$B13,'2023 NIST (for reference)'!$J$2:$N$2,0))","v":1},5.355218767996643,5.0432209761759799,5.9248992755744654,5.5502645996897231,5.5502645996897231,6.2302829552215426,6.3028007721016657,6.2302829552215426,0.84362183838221783,0.70591713964079483,0.90472467163879389,0.86205559858561076,0.86205559858561076,1,1.0031508877058128,1,5.355218767996643,5.0432209761759799,5.9248992755744654,5.5502645996897231,5.5502645996897231,6.2302829552215426,6.3028007721016657,6.2302829552215426,0.12654327575733268,10.849946436279016,2.1622919652167174,3.0861590429364867,2.9654712591345009,280,56.497457995591382,0,1.7999999999999999E-2,0.32275099999999995,0.35075000000000001,0.62158999999999998,0.62158999999999998,115.58035999999998,0,0,0.14454327575733267,14.196874306279014,2.5130419652167175,3.7077490429364865,3.5870612591345008,395.58035999999998,56.497457995591382,0,0.85075500740042775,0.77671981530962486,0.93256961321707676,0.8999237981239363,0.90125582191632325,1.0398454054794057,1.0031508877058128,1,5.3933505852944386,5.3122237451399608,6.0164032752923626,5.7054348534704564,5.7108930076057609,6.3632580973756676,6.3028007721016657,6.2302829552215426,0.85075500740042775,0.77671981530962486,0.93256961321707676,0.8999237981239363,0.90125582191632325,1.0398454054794057,1.0031508877058128,1,5.3933505852944386,5.3122237451399608,6.0164032752923626,5.7054348534704564,5.7108930076057609,6.3632580973756676,6.3028007721016657,6.2302829552215426]
["8Region 4 - West","Region 4 - West",8,{"$f":"INDEX('2023 NIST (for reference)'!$J$3:$N$250,MATCH(Calculator!$C14&D$4,'2023 NIST (for reference)'!$A$3:$A$250,0),MATCH(Calculator!$B14,'2023 NIST (for reference)'!$J$2:$N$2,0))","v":0.85237730143056756},{"$f":"INDEX('2023 NIST (for reference)'!$J$3:$N$250,MATCH(Calculator!$C14&E$4,'2023 NIST (for reference)'!$A$3:$A$250,0),MATCH(Calculator!$B14,'2023 NIST (for reference)'!$J$2:$N$2,0))","v":0.71119303080644869},{"$f":"INDEX('2023 NIST (for reference)'!$J$3:$N$250,MATCH(Calculator!$C14&F$4,'2023 NIST (for reference)'!$A$3:$A$250,0),MATCH(Calculator!$B14,'2023 NIST (for reference)'!$J$2:$N$2,0))","v":0.91226092544246129},{"$f":"INDEX('2023 NIST (for reference)'!$J$3:$N$250,MATCH(Calculator!$C14&G$4,'2023 NIST (for reference)'!$A$3:$A$250,0),MATCH(Calculator!$B14,'2023 NIST (for reference)'!$J$2:$N$2,0))","v":0.86547726425671789},{"$f":"INDEX('2023 NIST (for reference)'!$J$3:$N$250,MATCH(Calculator!$C14&H$4,'2023 NIST (for reference)'!$A$3:$A$250,0),MATCH(Calculator!$B14,'2023 NIST (for reference)'!$J$2:$N$2,0))","v":0.86547726425671789},{"$f":"INDEX('2023 NIST (for reference)'!$J$3:$N$250,MATCH(Calculator!$C14&I$4,'2023 NIST (for reference)'!$A$3:$A$250,0),MATCH(Calculator!$B14,'2023 NIST (for reference)'!$J$2:$N$2,0))","v":1},{"$f":"INDEX('2023 NIST (for reference)'!$J$3:$N$250,MATCH(Calculator!$C14&J$4,'2023 NIST (for reference)'!$A$3:$A$250,0),MATCH(Calculator!$B14,'2023 NIST (for reference)'!$J$2:$N$2,0))","v":0.998864722589065},{"$f":"INDEX('2023 NIST (for reference)'!$J$3:$N$250,MATCH(Calculator!$C14&K$4,'2023 NIST (for reference)'!$A$3:$A$250,0),MATCH(Calculator!$B14,'2023 NIST (for reference)'!$J$2:$N$2,0))","v":1},6.0280932808655265,5.6046433220743062,6.6450464742225215,6.2334803441827384,6.2334803441827384,7.019692189535478,7.0913138079439015,7.019692189535478,0.85237730143056756,0.71119303080644869,0.91226092544246129,0.86547726425671789,0.86547726425671789,1,0.998864722589065,1,6.0280932808655265,5.6046433220743062,6.6450464742225215,6.2334803441827384,6.2334803441827384,7.019692189535478,7.0913138079439015,7.019692189535478,0.12785659521458512,10.931036883495116,2.1803036118074828,3.0984086060390501,2.9772417890431093,280,56.256061176216143,0,1.7899999999999999E-2,0.32804199999999994,0.35649999999999998,0.63178000000000001,0.63178000000000001,117.47511999999999,0,0,0.14575659521458512,14.332832423495116,2.5368036118074828,3.7301886060390501,3.6090217890431093,397.47512,56.256061176216143,0,0.85789638148666936,0.78415816838761399,0.9413873687011719,0.90537020148663738,0.90677344595524934,1.0448260811643313,0.998864722589065,1,6.0705819109245267,5.9312454444278453,6.7595431572115654,6.4201424509966767,6.4267083392735032,7.1880534540988323,7.0913138079439015,7.019692189535478,0.85789638148666936,0.78415816838761399,0.9413873687011719,0.90537020148663738,0.90677344595524934,1.0448260811643313,0.998864722589065,1,6.0705819109245267,5.9312454444278453,6.7595431572115654,6.4201424509966767,6.4267083392735032,7.1880534540988323,7.0913138079439015,7.019692189535478]
["9Region 4 - West","Region 4 - West",9,{"$f":"INDEX('2023 NIST (for reference)'!$J$3:$N$250,MATCH(Calculator!$C15&D$4,'2023 NIST (for reference)'!$A$3:$A$250,0),MATCH(Calculator!$B15,'2023 NIST (for reference)'!$J$2:$N$2,0))","v":0.86307059287030707},{"$f":"INDEX('2023 NIST (for reference)'!$J$3:$N$250,MATCH(Calculator!$C15&E$4,'2023 NIST (for reference)'!$A$3:$A$250,0),MATCH(Calculator!$B15,'2023 NIST (for reference)'!$J$2:$N$2,0))","v":0.71696837151239889},{"$f":"INDEX('2023 NIST (for reference)'!$J$3:$N$250,MATCH(Calculator!$C15&F$4,'2023 NIST (for reference)'!$A$3:$A$250,0),MATCH(Calculator!$B15,'2023 NIST (for reference)'!$J$2:$N$2,0))","v":0.92562041898224612},{"$f":"INDEX('2023 NIST (for reference)'!$J$3:$N$250,MATCH(Calculator!$C15&G$4,'2023 NIST (for reference)'!$A$3:$A$250,0),MATCH(Calculator!$B15,'2023 NIST (for reference)'!$J$2:$N$2,0))","v":0.86933002324909658},{"$f":"INDEX('2023 NIST (for reference)'!$J$3:$N$250,MATCH(Calculator!$C15&H$4,'2023 NIST (for reference)'!$A$3:$A$250,0),MATCH(Calculator!$B15,'2023 NIST (for reference)'!$J$2:$N$2,0))","v":0.86933002324909658},{"$f":"INDEX('2023 NIST (for reference)'!$J$3:$N$250,MATCH(Calculator!$C15&I$4,'2023 NIST (for reference)'!$A$3:$A$250,0),MATCH(Calculator!$B15,'2023 NIST (for reference)'!$J$2:$N$2,0))","v":1},{"$f":"INDEX('2023 NIST (for reference)'!$J$3:$N$250,MATCH(Calculator!$C15&J$4,'2023 NIST (for reference)'!$A$3:$A$250,0),MATCH(Calculator!$B15,'2023 NIST (for reference)'!$J$2:$N$2,0))","v":0.99395382073894578},{"$f":"INDEX('2023 NIST (for reference)'!$J$3:$N$250,MATCH(Calculator!$C15&K$4,'2023 NIST (for reference)'!$A$3:$A$250,0),MATCH(Calculator!$B15,'2023 NIST (for reference)'!$J$2:$N$2,0))","v":1},6.6895650244350637,6.1541398785625709,7.3544574511294334,6.8997494199295204,6.8997494199295204,7.7861089218791051,7.8530966473351071,7.7861089218791051,0.86307059287030707,0.71696837151239889,0.92562041898224612,0.86933002324909658,0.86933002324909658,1,0.99395382073894578,1,6.6895650244350637,6.1541398785625709,7.3544574511294334,6.8997494199295204,6.8997494199295204,7.7861089218791051,7.8530966473351071,7.7861089218791051,0.12946058893054604,11.019803870145571,2.2122328013675685,3.1122014832317659,2.990495279976892,280,55.979479184017428,0,1.7899999999999999E-2,0.33333299999999999,0.36225000000000002,0.64196999999999993,0.64196999999999993,119.36987999999998,0,0,0.14736058893054604,14.476467080145571,2.5744828013675685,3.7541714832317661,3.6324652799768922,399.36987999999997,55.979479184017428,0,0.86733719205736348,0.79201650970829895,0.95536981217833505,0.91119118928362042,0.91266366671362364,1.0498067568492571,0.99395382073894578,1,6.7353236475012279,6.538260149760684,7.4917545668410295,7.1184946248277328,7.1261890444449119,7.9926429182755001,7.8530966473351071,7.7861089218791051,0.86733719205736348,0.79201650970829895,0.95536981217833505,0.91119118928362042,0.91266366671362364,1.0498067568492571,0.99395382073894578,1,6.7353236475012279,6.538260149760684,7.4917545668410295,7.1184946248277328,7.1261890444449119,7.9926429182755001,7.8530966473351071,7.7861089218791051]
["10Region 4 - West","Region 4 - West",10,{"$f":"INDEX('2023 NIST (for reference)'!$J$3:$N$250,MATCH(Calculator!$C16&D$4,'2023 NIST (for reference)'!$A$3:$A$250,0),MATCH(Calculator!$B16,'2023 NIST (for reference)'!$J$2:$N$2,0))","v":0.8743015768109712},{"$f":"INDEX('2023 NIST (for reference)'!$J$3:$N$250,MATCH(Calculator!$C16&E$4,'2023 NIST (for reference)'!$A$3:$A$250,0),MATCH(Calculator!$B16,'2023 NIST (for reference)'!$J$2:$N$2,0))","v":0.72576281843064205},{"$f":"INDEX('2023 NIST (for reference)'!$J$3:$N$250,MATCH(Calculator!$C16&F$4,'2023 NIST (for reference)'!$A$3:$A$250,0),MATCH(Calculator!$B16,'2023 NIST (for reference)'!$J$2:$N$2,0))","v":0.94342561207875375},{"$f":"INDEX('2023 NIST (for reference)'!$J$3:$N$250,MATCH(Calculator!$C16&G$4,'2023 NIST (for reference)'!$A$3:$A$250,0),MATCH(Calculator!$B16,'2023 NIST (for reference)'!$J$2:$N$2,0))","v":0.87135834742203488},{"$f":"INDEX('2023 NIST (for reference)'!$J$3:$N$250,MATCH(Calculator!$C16&H$4,'2023 NIST (for reference)'!$A$3:$A$250,0),MATCH(Calculator!$B16,'2023 NIST (for reference)'!$J$2:$N$2,0))","v":0.87135834742203488},{"$f":"INDEX('2023 NIST (for reference)'!$J$3:$N$250,MATCH(Calculator!$C16&I$4,'2023 NIST (for reference)'!$A$3:$A$250,0),MATCH(Calculator!$B16,'2023 NIST (for reference)'!$J$2:$N$2,0))","v":1},{"$f":"INDEX('2023 NIST (for reference)'!$J$3:$N$250,MATCH(Calculator!$C16&J$4,'2023 NIST (for reference)'!$A$3:$A$250,0),MATCH(Calculator!$B16,'2023 NIST (for reference)'!$J$2:$N$2,0))","v":0.98999259627037806},{"$f":"INDEX('2023 NIST (for reference)'!$J$3:$N$250,MATCH(Calculator!$C16&K$4,'2023 NIST (for reference)'!$A$3:$A$250,0),MATCH(Calculator!$B16,'2023 NIST (for reference)'!$J$2:$N$2,0))","v":1},7.340127507524719,6.6941755754151089,8.056454708234952,7.5481218639407235,7.5481218639407235,8.53020283677583,8.5897441140127064,8.53020283677583,0.8743015768109712,0.72576281843064205,0.94342561207875375,0.87135834742203488,0.87135834742203488,1,0.98999259627037806,1,7.340127507524719,6.6941755754151089,8.056454708234952,7.5481218639407235,7.5481218639407235,8.53020283677583,8.5897441140127064,8.53020283677583,0.13114523652164567,11.154974519278968,2.2547872128682216,3.1194628837708849,2.9974727151318001,280,55.756383021947691,0,1.7899999999999999E-2,0.33862399999999998,0.36799999999999999,0.65215999999999996,0.65215999999999996,121.26463999999999,0,0,0.14904523652164567,14.666505399278968,2.6227872128682215,3.7716228837708847,3.6496327151318,401.26463999999999,55.756383021947691,0,0.87725271643111047,0.80241362423890805,0.97329518985739738,0.91542689414764422,0.91697701676900156,1.0547874325341828,0.98999259627037806,1,7.3880820556242393,7.1353312447870829,8.2159775950121716,7.7996582062958035,7.8085060627228779,8.7775038283337263,8.5897441140127064,8.53020283677583,0.87725271643111047,0.80241362423890805,0.97329518985739738,0.91542689414764422,0.91697701676900156,1.0547874325341828,0.98999259627037806,1,7.3880820556242393,7.1353312447870829,8.2159775950121716,7.7996582062958035,7.8085060627228779,8.7775038283337263,8.5897441140127064,8.53020283677583]
["11Region 4 - West","Region 4 - West",11,{"$f":"INDEX('2023 NIST (for reference)'!$J$3:$N$250,MATCH(Calculator!$C17&D$4,'2023 NIST (for reference)'!$A$3:$A$250,0),MATCH(Calculator!$B17,'2023 NIST (for reference)'!$J$2:$N$2,0))","v":0.88463585004845546},{"$f":"INDEX('2023 NIST (for reference)'!$J$3:$N$250,MATCH(Calculator!$C17&E$4,'2023 NIST (for reference)'!$A$3:$A$250,0),MATCH(Calculator!$B17,'2023 NIST (for reference)'!$J$2:$N$2,0))","v":0.73548382624922659},{"$f":"INDEX('2023 NIST (for reference)'!$J$3:$N$250,MATCH(Calculator!$C17&F$4,'2023 NIST (for reference)'!$A$3:$A$250,0),MATCH(Calculator!$B17,'2023 NIST (for reference)'!$J$2:$N$2,0))","v":0.96226126106868259},{"$f":"INDEX('2023 NIST (for reference)'!$J$3:$N$250,MATCH(Calculator!$C17&G$4,'2023 NIST (for reference)'!$A$3:$A$250,0),MATCH(Calculator!$B17,'2023 NIST (for reference)'!$J$2:$N$2,0))","v":0.87396763122519694},{"$f":"INDEX('2023 NIST (for reference)'!$J$3:$N$250,MATCH(Calculator!$C17&H$4,'2023 NIST (for reference)'!$A$3:$A$250,0),MATCH(Calculator!$B17,'2023 NIST (for reference)'!$J$2:$N$2,0))","v":0.87396763122519694},{"$f":"INDEX('2023 NIST (for reference)'!$J$3:$N$250,MATCH(Calculator!$C17&I$4,'2023 NIST (for reference)'!$A$3:$A$250,0),MATCH(Calculator!$B17,'2023 NIST (for reference)'!$J$2:$N$2,0))","v":1},{"$f":"INDEX('2023 NIST (for reference)'!$J$3:$N$250,MATCH(Calculator!$C17&J$4,'2023 NIST (for reference)'!$A$3:$A$250,0),MATCH(Calculator!$B17,'2023 NIST (for reference)'!$J$2:$N$2,0))","v":0.98754377488635114},{"$f":"INDEX('2023 NIST (for reference)'!$J$3:$N$250,MATCH(Calculator!$C17&K$4,'2023 NIST (for reference)'!$A$3:$A$250,0),MATCH(Calculator!$B17,'2023 NIST (for reference)'!$J$2:$N$2,0))","v":1},7.9792072676417556,7.2255047400918171,8.7516127168777249,8.1794946757964269,8.1794946757964269,9.2526241133745923,9.3031667485632656,9.2526241133745923,0.88463585004845546,0.73548382624922659,0.96226126106868259,0.87396763122519694,0.87396763122519694,1,0.98754377488635114,1,7.9792072676417556,7.2255047400918171,8.7516127168777249,8.1794946757964269,8.1794946757964269,9.2526241133745923,9.3031667485632656,9.2526241133745923,0.13269537750726831,11.304386409450613,2.2998044139541514,3.1288041197862051,3.0064486514146775,280,55.618465401599295,0,1.8200000000000001E-2,0.34391499999999997,0.37375000000000003,0.66234999999999999,0.66234999999999999,123.15939999999999,0,0,0.15089537750726831,14.870784959450612,2.6735544139541512,3.7911541197862051,3.6687986514146775,403.15940000000001,55.618465401599295,0,0.88814230433942498,0.81358988591630232,0.99213448889661426,0.92016740487084081,0.92179249395479912,1.0597681082191086,0.98754377488635114,1,8.0296949529264925,7.7230858887985789,8.9327166590385243,8.4644067176071669,8.474428572964861,9.5431028579720305,9.3031667485632656,9.2526241133745923,0.88814230433942498,0.81358988591630232,0.99213448889661426,0.92016740487084081,0.92179249395479912,1.0597681082191086,0.98754377488635114,1,8.0296949529264925,7.7230858887985789,8.9327166590385243,8.4644067176071669,8.474428572964861,9.5431028579720305,9.3031667485632656,9.2526241133745923]
["12Region 4 - West","Region 4 - West",12,{"$f":"INDEX('2023 NIST (for reference)'!$J$3:$N$250,MATCH(Calculator!$C18&D$4,'2023 NIST (for reference)'!$A$3:$A$250,0),MATCH(Calculator!$B18,'2023 NIST (for reference)'!$J$2:$N$2,0))","v":0.89390659926212412},{"$f":"INDEX('2023 NIST (for reference)'!$J$3:$N$250,MATCH(Calculator!$C18&E$4,'2023 NIST (for reference)'!$A$3:$A$250,0),MATCH(Calculator!$B18,'2023 NIST (for reference)'!$J$2:$N$2,0))","v":0.74432053488527972},{"$f":"INDEX('2023 NIST (for reference)'!$J$3:$N$250,MATCH(Calculator!$C18&F$4,'2023 NIST (for reference)'!$A$3:$A$250,0),MATCH(Calculator!$B18,'2023 NIST (for reference)'!$J$2:$N$2,0))","v":0.97828506348502164},{"$f":"INDEX('2023 NIST (for reference)'!$J$3:$N$250,MATCH(Calculator!$C18&G$4,'2023 NIST (for reference)'!$A$3:$A$250,0),MATCH(Calculator!$B18,'2023 NIST (for reference)'!$J$2:$N$2,0))","v":0.87693841076462198},{"$f":"INDEX('2023 NIST (for reference)'!$J$3:$N$250,MATCH(Calculator!$C18&H$4,'2023 NIST (for reference)'!$A$3:$A$250,0),MATCH(Calculator!$B18,'2023 NIST (for reference)'!$J$2:$N$2,0))","v":0.87693841076462198},{"$f":"INDEX('2023 NIST (for reference)'!$J$3:$N$250,MATCH(Calculator!$C18&I$4,'2023 NIST (for reference)'!$A$3:$A$250,0),MATCH(Calculator!$B18,'2023 NIST (for reference)'!$J$2:$N$2,0))","v":1},{"$f":"INDEX('2023 NIST (for reference)'!$J$3:$N$250,MATCH(Calculator!$C18&J$4,'2023 NIST (for reference)'!$A$3:$A$250,0),MATCH(Calculator!$B18,'2023 NIST (for reference)'!$J$2:$N$2,0))","v":0.98550263565661222},{"$f":"INDEX('2023 NIST (for reference)'!$J$3:$N$250,MATCH(Calculator!$C18&K$4,'2023 NIST (for reference)'!$A$3:$A$250,0),MATCH(Calculator!$B18,'2023 NIST (for reference)'!$J$2:$N$2,0))","v":1},8.606175371135933,7.7475561876748245,9.4377621774994243,8.7945616332751335,8.7945616332751335,9.9540039935675662,9.9943784690899591,9.9540039935675662,0.89390659926212412,0.74432053488527972,0.97828506348502164,0.87693841076462198,0.87693841076462198,1,0.98550263565661222,1,8.606175371135933,7.7475561876748245,9.4377621774994243,8.7945616332751335,8.7945616332751335,9.9540039935675662,9.9943784690899591,9.9540039935675662,0.13408598988931861,11.440206621186748,2.3381013017292021,3.1394395105373469,3.0166681330302993,280,55.503508440180404,0,1.78E-2,0.34920599999999996,0.3795,0.67254000000000003,0.67254000000000003,125.05416,0,0,0.15188598988931862,15.061472841186747,2.7176013017292022,3.8119795105373471,3.6892081330302995,405.05416000000002,55.503508440180404,0,0.89397286574054513,0.82402253842054884,1.0084799338451442,0.92522202548435994,0.92692041422143312,1.0647487839040344,0.98550263565661234,1,8.6567095343953646,8.3010387180722933,9.6400441942158483,9.1133388309932872,9.1245519020399115,10.289896232462256,9.9943784690899591,9.9540039935675662,0.89397286574054513,0.82402253842054884,1.0084799338451442,0.92522202548435994,0.92692041422143312,1.0647487839040344,0.98550263565661234,1,8.6567095343953646,8.3010387180722933,9.6400441942158483,9.1133388309932872,9.1245519020399115,10.289896232462256,9.9943784690899591,9.9540039935675662]
["13Region 4 - West","Region 4 - West",13,{"$f":"INDEX('2023 NIST (for reference)'!$J$3:$N$250,MATCH(Calculator!$C19&D$4,'2023 NIST (for reference)'!$A$3:$A$250,0),MATCH(Calculator!$B19,'2023 NIST (for reference)'!$J$2:$N$2,0))","v":0.90148413861450183},{"$f":"INDEX('2023 NIST (for reference)'!$J$3:$N$250,MATCH(Calculator!$C19&E$4,'2023 NIST (for reference)'!$A$3:$A$250,0),MATCH(Calculator!$B19,'2023 NIST (for reference)'!$J$2:$N$2,0))","v":0.74851464443343485},{"$f":"INDEX('2023 NIST (for reference)'!$J$3:$N$250,MATCH(Calculator!$C19&F$4,'2023 NIST (for reference)'!$A$3:$A$250,0),MATCH(Calculator!$B19,'2023 NIST (for reference)'!$J$2:$N$2,0))","v":0.99051258041591295},{"$f":"INDEX('2023 NIST (for reference)'!$J$3:$N$250,MATCH(Calculator!$C19&G$4,'2023 NIST (for reference)'!$A$3:$A$250,0),MATCH(Calculator!$B19,'2023 NIST (for reference)'!$J$2:$N$2,0))","v":0.87942932981491606},{"$f":"INDEX('2023 NIST (for reference)'!$J$3:$N$250,MATCH(Calculator!$C19&H$4,'2023 NIST (for reference)'!$A$3:$A$250,0),MATCH(Calculator!$B19,'2023 NIST (for reference)'!$J$2:$N$2,0))","v":0.87942932981491606},{"$f":"INDEX('2023 NIST (for reference)'!$J$3:$N$250,MATCH(Calculator!$C19&I$4,'2023 NIST (for reference)'!$A$3:$A$250,0),MATCH(Calculator!$B19,'2023 NIST (for reference)'!$J$2:$N$2,0))","v":1},{"$f":"INDEX('2023 NIST (for reference)'!$J$3:$N$250,MATCH(Calculator!$C19&J$4,'2023 NIST (for reference)'!$A$3:$A$250,0),MATCH(Calculator!$B19,'2023 NIST (for reference)'!$J$2:$N$2,0))","v":0.983826355068257},{"$f":"INDEX('2023 NIST (for reference)'!$J$3:$N$250,MATCH(Calculator!$C19&K$4,'2023 NIST (for reference)'!$A$3:$A$250,0),MATCH(Calculator!$B19,'2023 NIST (for reference)'!$J$2:$N$2,0))","v":1},9.2200422033080738,8.2572582378062886,10.112253046413741,9.3934102138419036,9.3934102138419036,10.634955333560743,10.664316343894292,10.634955333560743,0.90148413861450183,0.74851464443343485,0.99051258041591295,0.87942932981491606,0.87942932981491606,1,0.983826355068257,1,9.2200422033080738,8.2572582378062886,10.112253046413741,9.3934102138419036,9.3934102138419036,10.634955333560743,10.664316343894292,10.634955333560743,0.13522262079217526,11.504670084941893,2.3673250671940322,3.1483570007373998,3.025236894563311,280,55.409100317444235,0,1.7600000000000001E-2,0.35449700000000001,0.38525000000000004,0.68273000000000006,0.68273000000000006,126.94891999999999,0,0,0.15282262079217526,15.180803974941892,2.7525750671940323,3.8310870007373996,3.7079668945633113,406.94891999999999,55.409100317444235,0,0.89948570213169665,0.83055121890129313,1.0214584162516123,0.92985968702895816,0.931633587993003,1.0697294595889599,0.983826355068257,1,9.2692155285666473,8.8666036835160966,10.335607671509694,9.7465280308812936,9.7589490421663996,11.018329941399536,10.664316343894292,10.634955333560743,0.89948570213169665,0.83055121890129313,1.0214584162516123,0.92985968702895816,0.931633587993003,1.0697294595889599,0.983826355068257,1,9.2692155285666473,8.8666036835160966,10.335607671509694,9.7465280308812936,9.7589490421663996,11.018329941399536,10.664316343894292,10.634955333560743]
["14Region 4 - West","Region 4 - West",14,{"$f":"INDEX('2023 NIST (for reference)'!$J$3:$N$250,MATCH(Calculator!$C20&D$4,'2023 NIST (for reference)'!$A$3:$A$250,0),MATCH(Calculator!$B20,'2023 NIST (for reference)'!$J$2:$N$2,0))","v":0.91082165652319014},{"$f":"INDEX('2023 NIST (for reference)'!$J$3:$N$250,MATCH(Calculator!$C20&E$4,'2023 NIST (for reference)'!$A$3:$A$250,0),MATCH(Calculator!$B20,'2023 NIST (for reference)'!$J$2:$N$2,0))","v":0.75258583376316301},{"$f":"INDEX('2023 NIST (for reference)'!$J$3:$N$250,MATCH(Calculator!$C20&F$4,'2023 NIST (for reference)'!$A$3:$A$250,0),MATCH(Calculator!$B20,'2023 NIST (for reference)'!$J$2:$N$2,0))","v":1.0008712437542604},{"$f":"INDEX('2023 NIST (for reference)'!$J$3:$N$250,MATCH(Calculator!$C20&G$4,'2023 NIST (for reference)'!$A$3:$A$250,0),MATCH(Calculator!$B20,'2023 NIST (for reference)'!$J$2:$N$2,0))","v":0.88183042675171408},{"$f":"INDEX('2023 NIST (for reference)'!$J$3:$N$250,MATCH(Calculator!$C20&H$4,'2023 NIST (for reference)'!$A$3:$A$250,0),MATCH(Calculator!$B20,'2023 NIST (for reference)'!$J$2:$N$2,0))","v":0.88183042675171408},{"$f":"INDEX('2023 NIST (for reference)'!$J$3:$N$250,MATCH(Calculator!$C20&I$4,'2023 NIST (for reference)'!$A$3:$A$250,0),MATCH(Calculator!$B20,'2023 NIST (for reference)'!$J$2:$N$2,0))","v":1},{"$f":"INDEX('2023 NIST (for reference)'!$J$3:$N$250,MATCH(Calculator!$C20&J$4,'2023 NIST (for reference)'!$A$3:$A$250,0),MATCH(Calculator!$B20,'2023 NIST (for reference)'!$J$2:$N$2,0))","v":0.98293976559455631},{"$f":"INDEX('2023 NIST (for reference)'!$J$3:$N$250,MATCH(Calculator!$C20&K$4,'2023 NIST (for reference)'!$A$3:$A$250,0),MATCH(Calculator!$B20,'2023 NIST (for reference)'!$J$2:$N$2,0))","v":1},9.822202618360766,8.7548061329139664,10.77394684699151,9.9764040106800937,9.9764040106800937,11.296073139379363,11.314155324976033,11.296073139379363,0.91082165652319014,0.75258583376316301,1.0008712437542604,0.88183042675171408,0.88183042675171408,1,0.98293976559455631,1,9.822202618360766,8.7548061329139664,10.77394684699151,9.9764040106800937,9.9764040106800937,11.296073139379363,11.314155324976033,11.296073139379363,0.13662324847847851,11.567244264939815,2.3920822725726825,3.1569529277711363,3.0334966680258963,280,55.35916759828541,0,1.7600000000000001E-2,0.36507899999999999,0.39675000000000005,0.70311000000000001,0.70311000000000001,130.73844,0,0,0.15422324847847851,15.353113494939814,2.7888322725726824,3.8600629277711365,3.7366066680258965,410.73843999999997,55.35916759828541,0,0.90772953783683652,0.83997837981443046,1.0349131728630421,0.93689255953688566,0.93882938441431851,1.0796908109588113,0.98293976559455631,1,9.869331688898086,9.4219283469140915,11.019807197565694,10.365924384130109,10.379625864828439,11.73213276130315,11.314155324976033,11.296073139379363,0.90772953783683652,0.83997837981443046,1.0349131728630421,0.93689255953688566,0.93882938441431851,1.0796908109588113,0.98293976559455631,1,9.869331688898086,9.4219283469140915,11.019807197565694,10.365924384130109,10.379625864828439,11.73213276130315,11.314155324976033,11.296073139379363]
["15Region 4 - West","Region 4 - West",15,{"$f":"INDEX('2023 NIST (for reference)'!$J$3:$N$250,MATCH(Calculator!$C21&D$4,'2023 NIST (for reference)'!$A$3:$A$250,0),MATCH(Calculator!$B21,'2023 NIST (for reference)'!$J$2:$N$2,0))","v":0.92203331918195996},{"$f":"INDEX('2023 NIST (for reference)'!$J$3:$N$250,MATCH(Calculator!$C21&E$4,'2023 NIST (for reference)'!$A$3:$A$250,0),MATCH(Calculator!$B21,'2023 NIST (for reference)'!$J$2:$N$2,0))","v":0.76050682310848683},{"$f":"INDEX('2023 NIST (for reference)'!$J$3:$N$250,MATCH(Calculator!$C21&F$4,'2023 NIST (for reference)'!$A$3:$A$250,0),MATCH(Calculator!$B21,'2023 NIST (for reference)'!$J$2:$N$2,0))","v":1.0131174758312005},{"$f":"INDEX('2023 NIST (for reference)'!$J$3:$N$250,MATCH(Calculator!$C21&G$4,'2023 NIST (for reference)'!$A$3:$A$250,0),MATCH(Calculator!$B21,'2023 NIST (for reference)'!$J$2:$N$2,0))","v":0.88458739626402361},{"$f":"INDEX('2023 NIST (for reference)'!$J$3:$N$250,MATCH(Calculator!$C21&H$4,'2023 NIST (for reference)'!$A$3:$A$250,0),MATCH(Calculator!$B21,'2023 NIST (for reference)'!$J$2:$N$2,0))","v":0.88458739626402361},{"$f":"INDEX('2023 NIST (for reference)'!$J$3:$N$250,MATCH(Calculator!$C21&I$4,'2023 NIST (for reference)'!$A$3:$A$250,0),MATCH(Calculator!$B21,'2023 NIST (for reference)'!$J$2:$N$2,0))","v":1},{"$f":"INDEX('2023 NIST (for reference)'!$J$3:$N$250,MATCH(Calculator!$C21&J$4,'2023 NIST (for reference)'!$A$3:$A$250,0),MATCH(Calculator!$B21,'2023 NIST (for reference)'!$J$2:$N$2,0))","v":0.98280573923407222},{"$f":"INDEX('2023 NIST (for reference)'!$J$3:$N$250,MATCH(Calculator!$C21&K$4,'2023 NIST (for reference)'!$A$3:$A$250,0),MATCH(Calculator!$B21,'2023 NIST (for reference)'!$J$2:$N$2,0))","v":1},10.414020720175559,9.2429465234028712,11.424228402970172,10.544186999488712,10.544186999488712,11.937935086776081,11.944980930673486,11.937935086776081,0.92203331918195996,0.76050682310848683,1.0131174758312005,0.88458739626402361,0.88458739626402361,1,0.98280573923407222,1,10.414020720175559,9.2429465234028712,11.424228402970172,10.544186999488712,10.544186999488712,11.937935086776081,11.944980930673486,11.937935086776081,0.138304997877294,11.688989871177442,2.4213507672365693,3.1668228786252044,3.0429806431482413,280,55.351619233662944,0,1.77E-2,0.37036999999999998,0.40250000000000002,0.71330000000000005,0.71330000000000005,132.63319999999999,0,0,0.15600499787729399,15.529726771177442,2.8238507672365691,3.8801228786252047,3.7562806431482416,412.63319999999999,55.351619233662944,0,0.91821658550496765,0.84964100190581904,1.0479082539146745,0.94176139692413108,0.94377250730470608,1.084671486643737,0.98280573923407222,1,10.458699974602268,9.9672805749854589,11.692419630116461,10.970405188342884,10.985397524266521,12.428342114005993,11.944980930673486,11.937935086776081,0.91821658550496765,0.84964100190581904,1.0479082539146745,0.94176139692413108,0.94377250730470608,1.084671486643737,0.98280573923407222,1,10.458699974602268,9.9672805749854589,11.692419630116461,10.970405188342884,10.985397524266521,12.428342114005993,11.944980930673486,11.937935086776081]
["16Region 4 - West","Region 4 - West",16,{"$f":"INDEX('2023 NIST (for reference)'!$J$3:$N$250,MATCH(Calculator!$C22&D$4,'2023 NIST (for reference)'!$A$3:$A$250,0),MATCH(Calculator!$B22,'2023 NIST (for reference)'!$J$2:$N$2,0))","v":0.93182764230163784},{"$f":"INDEX('2023 NIST (for reference)'!$J$3:$N$250,MATCH(Calculator!$C22&E$4,'2023 NIST (for reference)'!$A$3:$A$250,0),MATCH(Calculator!$B22,'2023 NIST (for reference)'!$J$2:$N$2,0))","v":0.76114530931431823},{"$f":"INDEX('2023 NIST (for reference)'!$J$3:$N$250,MATCH(Calculator!$C22&F$4,'2023 NIST (for reference)'!$A$3:$A$250,0),MATCH(Calculator!$B22,'2023 NIST (for reference)'!$J$2:$N$2,0))","v":1.021084378445011},{"$f":"INDEX('2023 NIST (for reference)'!$J$3:$N$250,MATCH(Calculator!$C22&G$4,'2023 NIST (for reference)'!$A$3:$A$250,0),MATCH(Calculator!$B22,'2023 NIST (for reference)'!$J$2:$N$2,0))","v":0.88667469890902706},{"$f":"INDEX('2023 NIST (for reference)'!$J$3:$N$250,MATCH(Calculator!$C22&H$4,'2023 NIST (for reference)'!$A$3:$A$250,0),MATCH(Calculator!$B22,'2023 NIST (for reference)'!$J$2:$N$2,0))","v":0.88667469890902706},{"$f":"INDEX('2023 NIST (for reference)'!$J$3:$N$250,MATCH(Calculator!$C22&I$4,'2023 NIST (for reference)'!$A$3:$A$250,0),MATCH(Calculator!$B22,'2023 NIST (for reference)'!$J$2:$N$2,0))","v":1},{"$f":"INDEX('2023 NIST (for reference)'!$J$3:$N$250,MATCH(Calculator!$C22&J$4,'2023 NIST (for reference)'!$A$3:$A$250,0),MATCH(Calculator!$B22,'2023 NIST (for reference)'!$J$2:$N$2,0))","v":0.98242345287969679},{"$f":"INDEX('2023 NIST (for reference)'!$J$3:$N$250,MATCH(Calculator!$C22&K$4,'2023 NIST (for reference)'!$A$3:$A$250,0),MATCH(Calculator!$B22,'2023 NIST (for reference)'!$J$2:$N$2,0))","v":1},10.994704899909367,9.7172671161100226,12.060534429771222,11.096733357691766,11.096733357691766,12.561102025996195,12.557194746822583,12.561102025996195,0.93182764230163784,0.76114530931431823,1.021084378445011,0.88667469890902706,0.88667469890902706,1,0.98242345287969679,1,10.994704899909367,9.7172671161100226,12.060534429771222,11.096733357691766,11.096733357691766,12.561102025996195,12.557194746822583,12.561102025996195,0.13977414634524568,11.698803404161071,2.4403916644835766,3.1742954220943171,3.0501609642470529,280,55.330088866184525,0,1.78E-2,0.37566100000000002,0.40825000000000006,0.72349000000000008,0.72349000000000008,134.52796000000001,0,0,0.15757414634524569,15.59440797416107,2.8486416644835768,3.8977854220943171,3.7736509642470528,414.52796000000001,55.330088866184525,0,0.92745230338578988,0.85317975071429641,1.0571079560195109,0.94604834920142544,0.94813683283134542,1.0896521623286628,0.98242345287969679,1,11.036657587775837,10.498953988842667,12.351174359494371,11.559951242468978,11.576245052343884,13.107377316818924,12.557194746822583,12.561102025996195,0.92745230338578988,0.85317975071429641,1.0571079560195109,0.94604834920142544,0.94813683283134542,1.0896521623286628,0.98242345287969679,1,11.036657587775837,10.498953988842667,12.351174359494371,11.559951242468978,11.576245052343884,13.107377316818924,12.557194746822583,12.561102025996195]
["17Region 4 - West","Region 4 - West",17,{"$f":"INDEX('2023 NIST (for reference)'!$J$3:$N$250,MATCH(Calculator!$C23&D$4,'2023 NIST (for reference)'!$A$3:$A$250,0),MATCH(Calculator!$B23,'2023 NIST (for reference)'!$J$2:$N$2,0))","v":0.93989496388154936},{"$f":"INDEX('2023 NIST (for reference)'!$J$3:$N$250,MATCH(Calculator!$C23&E$4,'2023 NIST (for reference)'!$A$3:$A$250,0),MATCH(Calculator!$B23,'2023 NIST (for reference)'!$J$2:$N$2,0))","v":0.76500983620007323},{"$f":"INDEX('2023 NIST (for reference)'!$J$3:$N$250,MATCH(Calculator!$C23&F$4,'2023 NIST (for reference)'!$A$3:$A$250,0),MATCH(Calculator!$B23,'2023 NIST (for reference)'!$J$2:$N$2,0))","v":1.0303537378873688},{"$f":"INDEX('2023 NIST (for reference)'!$J$3:$N$250,MATCH(Calculator!$C23&G$4,'2023 NIST (for reference)'!$A$3:$A$250,0),MATCH(Calculator!$B23,'2023 NIST (for reference)'!$J$2:$N$2,0))","v":0.8889455339191682},{"$f":"INDEX('2023 NIST (for reference)'!$J$3:$N$250,MATCH(Calculator!$C23&H$4,'2023 NIST (for reference)'!$A$3:$A$250,0),MATCH(Calculator!$B23,'2023 NIST (for reference)'!$J$2:$N$2,0))","v":0.8889455339191682},{"$f":"INDEX('2023 NIST (for reference)'!$J$3:$N$250,MATCH(Calculator!$C23&I$4,'2023 NIST (for reference)'!$A$3:$A$250,0),MATCH(Calculator!$B23,'2023 NIST (for reference)'!$J$2:$N$2,0))","v":1},{"$f":"INDEX('2023 NIST (for reference)'!$J$3:$N$250,MATCH(Calculator!$C23&J$4,'2023 NIST (for reference)'!$A$3:$A$250,0),MATCH(Calculator!$B23,'2023 NIST (for reference)'!$J$2:$N$2,0))","v":0.98069830369882582},{"$f":"INDEX('2023 NIST (for reference)'!$J$3:$N$250,MATCH(Calculator!$C23&K$4,'2023 NIST (for reference)'!$A$3:$A$250,0),MATCH(Calculator!$B23,'2023 NIST (for reference)'!$J$2:$N$2,0))","v":1},11.563356810424382,10.180110648244082,12.683915386230712,11.634560025173124,11.634560025173124,13.166118471840967,13.150533348972443,13.166118471840967,0.93989496388154936,0.76500983620007323,1.0303537378873688,0.8889455339191682,0.8889455339191682,1,0.98069830369882582,1,11.563356810424382,10.180110648244082,12.683915386230712,11.634560025173124,11.634560025173124,13.166118471840967,13.150533348972443,13.166118471840967,0.14098424458223241,11.758201182395124,2.4625454335508117,3.1824250114306221,3.0579726366819386,280,55.232928464317872,0,1.7999999999999999E-2,0.38095200000000001,0.41400000000000003,0.73368,0.73368,136.42272,0,0,0.1589842445822324,15.708673422395124,2.8765454335508118,3.9161050114306222,3.7916526366819387,416.42272000000003,55.232928464317872,0,0.9357518810019565,0.85943128439233796,1.067462819760947,0.95049477592143383,0.95265978655700501,1.0946328380135886,0.98069830369882582,1,11.602802865012199,11.018924049973526,12.997006920777576,12.135016213590987,12.152619890505841,13.76964818597888,13.150533348972443,13.166118471840967,0.9357518810019565,0.85943128439233796,1.067462819760947,0.95049477592143383,0.95265978655700501,1.0946328380135886,0.98069830369882582,1,11.602802865012199,11.018924049973526,12.997006920777576,12.135016213590987,12.152619890505841,13.76964818597888,13.150533348972443,13.166118471840967]
["18Region 4 - West","Region 4 - West",18,{"$f":"INDEX('2023 NIST (for reference)'!$J$3:$N$250,MATCH(Calculator!$C24&D$4,'2023 NIST (for reference)'!$A$3:$A$250,0),MATCH(Calculator!$B24,'2023 NIST (for reference)'!$J$2:$N$2,0))","v":0.94907380726890966},{"$f":"INDEX('2023 NIST (for reference)'!$J$3:$N$250,MATCH(Calculator!$C24&E$4,'2023 NIST (for reference)'!$A$3:$A$250,0),MATCH(Calculator!$B24,'2023 NIST (for reference)'!$J$2:$N$2,0))","v":0.77077090741299525},{"$f":"INDEX('2023 NIST (for reference)'!$J$3:$N$250,MATCH(Calculator!$C24&F$4,'2023 NIST (for reference)'!$A$3:$A$250,0),MATCH(Calculator!$B24,'2023 NIST (for reference)'!$J$2:$N$2,0))","v":1.0404742772787023},{"$f":"INDEX('2023 NIST (for reference)'!$J$3:$N$250,MATCH(Calculator!$C24&G$4,'2023 NIST (for reference)'!$A$3:$A$250,0),MATCH(Calculator!$B24,'2023 NIST (for reference)'!$J$2:$N$2,0))","v":0.89329553387332161},{"$f":"INDEX('2023 NIST (for reference)'!$J$3:$N$250,MATCH(Calculator!$C24&H$4,'2023 NIST (for reference)'!$A$3:$A$250,0),MATCH(Calculator!$B24,'2023 NIST (for reference)'!$J$2:$N$2,0))","v":0.89329553387332161},{"$f":"INDEX('2023 NIST (for reference)'!$J$3:$N$250,MATCH(Calculator!$C24&I$4,'2023 NIST (for reference)'!$A$3:$A$250,0),MATCH(Calculator!$B24,'2023 NIST (for reference)'!$J$2:$N$2,0))","v":1},{"$f":"INDEX('2023 NIST (for reference)'!$J$3:$N$250,MATCH(Calculator!$C24&J$4,'2023 NIST (for reference)'!$A$3:$A$250,0),MATCH(Calculator!$B24,'2023 NIST (for reference)'!$J$2:$N$2,0))","v":0.97898990127258756},{"$f":"INDEX('2023 NIST (for reference)'!$J$3:$N$250,MATCH(Calculator!$C24&K$4,'2023 NIST (for reference)'!$A$3:$A$250,0),MATCH(Calculator!$B24,'2023 NIST (for reference)'!$J$2:$N$2,0))","v":1},12.120837647043995,10.632857322965984,13.295084366067671,12.159277004778023,12.159277004778023,13.75351307945725,13.725586737890758,13.75351307945725,0.94907380726890966,0.77077090741299525,1.0404742772787023,0.89329553387332161,0.89329553387332161,1,0.97898990127258756,1,12.120837647043995,10.632857322965984,13.295084366067671,12.159277004778023,12.159277004778023,13.75351307945725,13.725586737890758,13.75351307945725,0.14236107109033644,11.846748846937736,2.4867335226960989,3.1979980112664914,3.0729366365242261,280,55.136711239672131,0,1.7999999999999999E-2,0.38624299999999995,0.41974999999999996,0.74386999999999992,0.74386999999999992,138.31747999999996,0,0,0.16036107109033643,15.852088756937736,2.906483522696099,3.9418680112664912,3.8168066365242259,418.31747999999993,55.136711239672131,0,0.9438556273710208,0.8672776264642148,1.0785726032827161,0.95674782498027733,0.95897977586430039,1.0996135136985139,0.97898990127258756,1,12.15721857089822,11.528358251064855,13.630554651868499,12.69700472683301,12.715919439661603,14.41555523438738,13.725586737890758,13.75351307945725,0.9438556273710208,0.8672776264642148,1.0785726032827161,0.95674782498027733,0.95897977586430039,1.0996135136985139,0.97898990127258756,1,12.15721857089822,11.528358251064855,13.630554651868499,12.69700472683301,12.715919439661603,14.41555523438738,13.725586737890758,13.75351307945725]
["19Region 4 - West","Region 4 - West",19,{"$f":"INDEX('2023 NIST (for reference)'!$J$3:$N$250,MATCH(Calculator!$C25&D$4,'2023 NIST (for reference)'!$A$3:$A$250,0),MATCH(Calculator!$B25,'2023 NIST (for reference)'!$J$2:$N$2,0))","v":0.95699045465323618},{"$f":"INDEX('2023 NIST (for reference)'!$J$3:$N$250,MATCH(Calculator!$C25&E$4,'2023 NIST (for reference)'!$A$3:$A$250,0),MATCH(Calculator!$B25,'2023 NIST (for reference)'!$J$2:$N$2,0))","v":0.77365585155398331},{"$f":"INDEX('2023 NIST (for reference)'!$J$3:$N$250,MATCH(Calculator!$C25&F$4,'2023 NIST (for reference)'!$A$3:$A$250,0),MATCH(Calculator!$B25,'2023 NIST (for reference)'!$J$2:$N$2,0))","v":1.0483516471054155},{"$f":"INDEX('2023 NIST (for reference)'!$J$3:$N$250,MATCH(Calculator!$C25&G$4,'2023 NIST (for reference)'!$A$3:$A$250,0),MATCH(Calculator!$B25,'2023 NIST (for reference)'!$J$2:$N$2,0))","v":0.89486521688636955},{"$f":"INDEX('2023 NIST (for reference)'!$J$3:$N$250,MATCH(Calculator!$C25&H$4,'2023 NIST (for reference)'!$A$3:$A$250,0),MATCH(Calculator!$B25,'2023 NIST (for reference)'!$J$2:$N$2,0))","v":0.89486521688636955},{"$f":"INDEX('2023 NIST (for reference)'!$J$3:$N$250,MATCH(Calculator!$C25&I$4,'2023 NIST (for reference)'!$A$3:$A$250,0),MATCH(Calculator!$B25,'2023 NIST (for reference)'!$J$2:$N$2,0))","v":1},{"$f":"INDEX('2023 NIST (for reference)'!$J$3:$N$250,MATCH(Calculator!$C25&J$4,'2023 NIST (for reference)'!$A$3:$A$250,0),MATCH(Calculator!$B25,'2023 NIST (for reference)'!$J$2:$N$2,0))","v":0.97734247820694897},{"$f":"INDEX('2023 NIST (for reference)'!$J$3:$N$250,MATCH(Calculator!$C25&K$4,'2023 NIST (for reference)'!$A$3:$A$250,0),MATCH(Calculator!$B25,'2023 NIST (for reference)'!$J$2:$N$2,0))","v":1},12.666595931125126,11.074062444668503,13.892944661597156,12.669606133848342,12.669606133848342,14.323799106269174,14.282951496621919,14.323799106269174,0.95699045465323618,0.77365585155398331,1.0483516471054155,0.89486521688636955,0.89486521688636955,1,0.97734247820694897,1,12.666595931125126,11.074062444668503,13.892944661597156,12.669606133848342,12.669606133848342,14.323799106269174,14.282951496621919,14.323799106269174,0.14354856819798542,11.891090438384722,2.5055604365819431,3.2036174764532031,3.0783363460891113,280,55.043928372615369,0,1.8200000000000001E-2,0.39153399999999994,0.42549999999999999,0.75405999999999995,0.75405999999999995,140.21223999999998,0,0,0.16174856819798542,15.951298018384723,2.931060436581943,3.957677476453203,3.8323963460891113,420.21223999999995,55.043928372615369,0,0.9520221789169242,0.87270542680714147,1.0876928978873526,0.9605850086171358,0.96289671942682198,1.1045941893834397,0.97734247820694897,1,12.700143516749584,12.026049961495906,14.250850712996225,13.244812934812375,13.265045984013762,15.045489865890401,14.282951496621919,14.323799106269174,0.9520221789169242,0.87270542680714147,1.0876928978873526,0.9605850086171358,0.96289671942682198,1.1045941893834397,0.97734247820694897,1,12.700143516749584,12.026049961495906,14.250850712996225,13.244812934812375,13.265045984013762,15.045489865890401,14.282951496621919,14.323799106269174]
["20Region 4 - West","Region 4 - West",20,{"$f":"INDEX('2023 NIST (for reference)'!$J$3:$N$250,MATCH(Calculator!$C26&D$4,'2023 NIST (for reference)'!$A$3:$A$250,0),MATCH(Calculator!$B26,'2023 NIST (for reference)'!$J$2:$N$2,0))","v":0.9645589342359413},{"$f":"INDEX('2023 NIST (for reference)'!$J$3:$N$250,MATCH(Calculator!$C26&E$4,'2023 NIST (for reference)'!$A$3:$A$250,0),MATCH(Calculator!$B26,'2023 NIST (for reference)'!$J$2:$N$2,0))","v":0.77337994819727018},{"$f":"INDEX('2023 NIST (for reference)'!$J$3:$N$250,MATCH(Calculator!$C26&F$4,'2023 NIST (for reference)'!$A$3:$A$250,0),MATCH(Calculator!$B26,'2023 NIST (for reference)'!$J$2:$N$2,0))","v":1.0528491335810979},{"$f":"INDEX('2023 NIST (for reference)'!$J$3:$N$250,MATCH(Calculator!$C26&G$4,'2023 NIST (for reference)'!$A$3:$A$250,0),MATCH(Calculator!$B26,'2023 NIST (for reference)'!$J$2:$N$2,0))","v":0.89775335639638043},{"$f":"INDEX('2023 NIST (for reference)'!$J$3:$N$250,MATCH(Calculator!$C26&H$4,'2023 NIST (for reference)'!$A$3:$A$250,0),MATCH(Calculator!$B26,'2023 NIST (for reference)'!$J$2:$N$2,0))","v":0.89775335639638043},{"$f":"INDEX('2023 NIST (for reference)'!$J$3:$N$250,MATCH(Calculator!$C26&I$4,'2023 NIST (for reference)'!$A$3:$A$250,0),MATCH(Calculator!$B26,'2023 NIST (for reference)'!$J$2:$N$2,0))","v":1},{"$f":"INDEX('2023 NIST (for reference)'!$J$3:$N$250,MATCH(Calculator!$C26&J$4,'2023 NIST (for reference)'!$A$3:$A$250,0),MATCH(Calculator!$B26,'2023 NIST (for reference)'!$J$2:$N$2,0))","v":0.97725979661604001},{"$f":"INDEX('2023 NIST (for reference)'!$J$3:$N$250,MATCH(Calculator!$C26&K$4,'2023 NIST (for reference)'!$A$3:$A$250,0),MATCH(Calculator!$B26,'2023 NIST (for reference)'!$J$2:$N$2,0))","v":1},13.200648826495378,11.502264170759215,14.4758816996771,13.166670400524422,13.166670400524422,14.877474860455509,14.824036551549289,14.877474860455509,0.9645589342359413,0.77337994819727018,1.0528491335810979,0.89775335639638043,0.89775335639638043,1,0.97725979661604001,1,13.200648826495378,11.502264170759215,14.4758816996771,13.166670400524422,13.166670400524422,14.877474860455509,14.824036551549289,14.877474860455509,0.14468384013539118,11.886849803792042,2.5163094292588242,3.2139570158990418,3.0882715460035488,280,55.039271745415377,0,1.83E-2,0.39682499999999993,0.43124999999999997,0.76424999999999998,0.76424999999999998,142.10699999999997,0,0,0.16298384013539119,16.001925053792043,2.9475594292588241,3.9782070158990419,3.8525215460035489,422.10699999999997,55.039271745415377,0,0.95929276124420948,0.87547526337418469,1.0938155410553203,0.96556782188143453,0.96795321338658591,1.1095748650683654,0.97725979661604012,1,13.231280659816964,12.510779388216088,14.856469857630763,13.779424426810635,13.800978209452666,15.659834566133329,14.824036551549289,14.877474860455509,0.95929276124420948,0.87547526337418469,1.0938155410553203,0.96556782188143453,0.96795321338658591,1.1095748650683654,0.97725979661604012,1,13.231280659816964,12.510779388216088,14.856469857630763,13.779424426810635,13.800978209452666,15.659834566133329,14.824036551549289,14.877474860455509]
["21Region 4 - West","Region 4 - West",21,{"$f":"INDEX('2023 NIST (for reference)'!$J$3:$N$250,MATCH(Calculator!$C27&D$4,'2023 NIST (for reference)'!$A$3:$A$250,0),MATCH(Calculator!$B27,'2023 NIST (for reference)'!$J$2:$N$2,0))","v":0.97340569043555225},{"$f":"INDEX('2023 NIST (for reference)'!$J$3:$N$250,MATCH(Calculator!$C27&E$4,'2023 NIST (for reference)'!$A$3:$A$250,0),MATCH(Calculator!$B27,'2023 NIST (for reference)'!$J$2:$N$2,0))","v":0.7704535908826603},{"$f":"INDEX('2023 NIST (for reference)'!$J$3:$N$250,MATCH(Calculator!$C27&F$4,'2023 NIST (for reference)'!$A$3:$A$250,0),MATCH(Calculator!$B27,'2023 NIST (for reference)'!$J$2:$N$2,0))","v":1.0543706834817048},{"$f":"INDEX('2023 NIST (for reference)'!$J$3:$N$250,MATCH(Calculator!$C27&G$4,'2023 NIST (for reference)'!$A$3:$A$250,0),MATCH(Calculator!$B27,'2023 NIST (for reference)'!$J$2:$N$2,0))","v":0.89710097763432051},{"$f":"INDEX('2023 NIST (for reference)'!$J$3:$N$250,MATCH(Calculator!$C27&H$4,'2023 NIST (for reference)'!$A$3:$A$250,0),MATCH(Calculator!$B27,'2023 NIST (for reference)'!$J$2:$N$2,0))","v":0.89710097763432051},{"$f":"INDEX('2023 NIST (for reference)'!$J$3:$N$250,MATCH(Calculator!$C27&I$4,'2023 NIST (for reference)'!$A$3:$A$250,0),MATCH(Calculator!$B27,'2023 NIST (for reference)'!$J$2:$N$2,0))","v":1},{"$f":"INDEX('2023 NIST (for reference)'!$J$3:$N$250,MATCH(Calculator!$C27&J$4,'2023 NIST (for reference)'!$A$3:$A$250,0),MATCH(Calculator!$B27,'2023 NIST (for reference)'!$J$2:$N$2,0))","v":0.97796753592336461},{"$f":"INDEX('2023 NIST (for reference)'!$J$3:$N$250,MATCH(Calculator!$C27&K$4,'2023 NIST (for reference)'!$A$3:$A$250,0),MATCH(Calculator!$B27,'2023 NIST (for reference)'!$J$2:$N$2,0))","v":1},13.72390235055477,11.916420940659727,15.042657897122433,13.648906381469065,13.648906381469065,15.415024136364572,15.349742292347464,15.415024136364572,0.97340569043555225,0.7704535908826603,1.0543706834817048,0.89710097763432051,0.89710097763432051,1,0.97796753592336461,1,13.72390235055477,11.916420940659727,15.042657897122433,13.648906381469065,13.648906381469065,15.415024136364572,15.349742292347464,15.415024136364572,0.14601085356533283,11.841871691866489,2.5199459335212748,3.2116214999308674,3.0860273630620627,280,55.079131623203892,0,1.8599999999999998E-2,0.40740699999999996,0.44274999999999998,0.78462999999999994,0.78462999999999994,145.89651999999998,0,0,0.16461085356533284,16.066682281866488,2.9626959335212746,3.9962514999308674,3.8706573630620627,425.89652000000001,55.079131623203892,0,0.96886906159701491,0.87901817156262307,1.0994325757570367,0.96994747660376335,0.97250987119876353,1.119536216438217,0.97796753592336461,1,13.752095522329132,12.983294969850485,15.447469042639796,14.300818990528811,14.323750186529978,16.261640448633663,15.349742292347464,15.415024136364572,0.96886906159701491,0.87901817156262307,1.0994325757570367,0.96994747660376335,0.97250987119876353,1.119536216438217,0.97796753592336461,1,13.752095522329132,12.983294969850485,15.447469042639796,14.300818990528811,14.323750186529978,16.261640448633663,15.349742292347464,15.415024136364572]
["22Region 4 - West","Region 4 - West",22,{"$f":"INDEX('2023 NIST (for reference)'!$J$3:$N$250,MATCH(Calculator!$C28&D$4,'2023 NIST (for reference)'!$A$3:$A$250,0),MATCH(Calculator!$B28,'2023 NIST (for reference)'!$J$2:$N$2,0))","v":0.98259960897921395},{"$f":"INDEX('2023 NIST (for reference)'!$J$3:$N$250,MATCH(Calculator!$C28&E$4,'2023 NIST (for reference)'!$A$3:$A$250,0),MATCH(Calculator!$B28,'2023 NIST (for reference)'!$J$2:$N$2,0))","v":0.77406313870857735},{"$f":"INDEX('2023 NIST (for reference)'!$J$3:$N$250,MATCH(Calculator!$C28&F$4,'2023 NIST (for reference)'!$A$3:$A$250,0),MATCH(Calculator!$B28,'2023 NIST (for reference)'!$J$2:$N$2,0))","v":1.0573361850681946},{"$f":"INDEX('2023 NIST (for reference)'!$J$3:$N$250,MATCH(Calculator!$C28&G$4,'2023 NIST (for reference)'!$A$3:$A$250,0),MATCH(Calculator!$B28,'2023 NIST (for reference)'!$J$2:$N$2,0))","v":0.8988804625100687},{"$f":"INDEX('2023 NIST (for reference)'!$J$3:$N$250,MATCH(Calculator!$C28&H$4,'2023 NIST (for reference)'!$A$3:$A$250,0),MATCH(Calculator!$B28,'2023 NIST (for reference)'!$J$2:$N$2,0))","v":0.8988804625100687},{"$f":"INDEX('2023 NIST (for reference)'!$J$3:$N$250,MATCH(Calculator!$C28&I$4,'2023 NIST (for reference)'!$A$3:$A$250,0),MATCH(Calculator!$B28,'2023 NIST (for reference)'!$J$2:$N$2,0))","v":1},{"$f":"INDEX('2023 NIST (for reference)'!$J$3:$N$250,MATCH(Calculator!$C28&J$4,'2023 NIST (for reference)'!$A$3:$A$250,0),MATCH(Calculator!$B28,'2023 NIST (for reference)'!$J$2:$N$2,0))","v":0.97985988033346649},{"$f":"INDEX('2023 NIST (for reference)'!$J$3:$N$250,MATCH(Calculator!$C28&K$4,'2023 NIST (for reference)'!$A$3:$A$250,0),MATCH(Calculator!$B28,'2023 NIST (for reference)'!$J$2:$N$2,0))","v":1},14.236713717851183,12.32039868796137,15.594473723021325,14.11802535404294,14.11802535404294,15.936916637247158,15.861123815809208,15.936916637247158,0.98259960897921395,0.77406313870857735,1.0573361850681946,0.8988804625100687,0.8988804625100687,1,0.97985988033346649,1,14.236713717851183,12.32039868796137,15.594473723021325,14.11802535404294,14.11802535404294,15.936916637247158,15.861123815809208,15.936916637247158,0.14738994134688208,11.897350441950833,2.5270334823129854,3.2179920557860462,3.0921487910346364,280,55.18570846038083,0,1.8599999999999998E-2,0.41269799999999995,0.44850000000000001,0.79481999999999997,0.79481999999999997,147.79127999999997,0,0,0.16598994134688208,16.177028701950832,2.9755334823129855,4.0128120557860463,3.8869687910346364,427.79127999999997,55.18570846038083,0,0.97698611740366148,0.88505529277528905,1.1041964866176772,0.97396696070359146,0.97660814785534833,1.1245168921231428,0.97985988033346649,1,14.261977250468496,13.445198690016349,16.023740908506461,14.809125043427418,14.833434655196516,16.848517381748522,15.861123815809208,15.936916637247158,0.97698611740366148,0.88505529277528905,1.1041964866176772,0.97396696070359146,0.97660814785534833,1.1245168921231428,0.97985988033346649,1,14.261977250468496,13.445198690016349,16.023740908506461,14.809125043427418,14.833434655196516,16.848517381748522,15.861123815809208,15.936916637247158]
["23Region 4 - West","Region 4 - West",23,{"$f":"INDEX('2023 NIST (for reference)'!$J$3:$N$250,MATCH(Calculator!$C29&D$4,'2023 NIST (for reference)'!$A$3:$A$250,0),MATCH(Calculator!$B29,'2023 NIST (for reference)'!$J$2:$N$2,0))","v":0.99083640381687654},{"$f":"INDEX('2023 NIST (for reference)'!$J$3:$N$250,MATCH(Calculator!$C29&E$4,'2023 NIST (for reference)'!$A$3:$A$250,0),MATCH(Calculator!$B29,'2023 NIST (for reference)'!$J$2:$N$2,0))","v":0.84131919429998014},{"$f":"INDEX('2023 NIST (for reference)'!$J$3:$N$250,MATCH(Calculator!$C29&F$4,'2023 NIST (for reference)'!$A$3:$A$250,0),MATCH(Calculator!$B29,'2023 NIST (for reference)'!$J$2:$N$2,0))","v":1.0849084190407647},{"$f":"INDEX('2023 NIST (for reference)'!$J$3:$N$250,MATCH(Calculator!$C29&G$4,'2023 NIST (for reference)'!$A$3:$A$250,0),MATCH(Calculator!$B29,'2023 NIST (for reference)'!$J$2:$N$2,0))","v":0.90764854615200052},{"$f":"INDEX('2023 NIST (for reference)'!$J$3:$N$250,MATCH(Calculator!$C29&H$4,'2023 NIST (for reference)'!$A$3:$A$250,0),MATCH(Calculator!$B29,'2023 NIST (for reference)'!$J$2:$N$2,0))","v":0.90764854615200052},{"$f":"INDEX('2023 NIST (for reference)'!$J$3:$N$250,MATCH(Calculator!$C29&I$4,'2023 NIST (for reference)'!$A$3:$A$250,0),MATCH(Calculator!$B29,'2023 NIST (for reference)'!$J$2:$N$2,0))","v":1},{"$f":"INDEX('2023 NIST (for reference)'!$J$3:$N$250,MATCH(Calculator!$C29&J$4,'2023 NIST (for reference)'!$A$3:$A$250,0),MATCH(Calculator!$B29,'2023 NIST (for reference)'!$J$2:$N$2,0))","v":0.9801098274443335},{"$f":"INDEX('2023 NIST (for reference)'!$J$3:$N$250,MATCH(Calculator!$C29&K$4,'2023 NIST (for reference)'!$A$3:$A$250,0),MATCH(Calculator!$B29,'2023 NIST (for reference)'!$J$2:$N$2,0))","v":1},14.738762347708947,12.74668818150869,16.144187866751185,14.577923382852367,14.577923382852367,16.443608385676853,16.357737377930103,16.443608385676853,0.99083640381687654,0.84131919429998014,1.0849084190407647,0.90764854615200052,0.90764854615200052,1,0.9801098274443335,1,14.738762347708947,12.74668818150869,16.144187866751185,14.577923382852367,14.577923382852367,16.443608385676853,16.357737377930103,16.443608385676853,0.14862546057253148,12.931076016390694,2.5929311215074278,3.2493817952241622,3.1223109987628819,280,55.199785481664861,0,1.8599999999999998E-2,0.41798899999999994,0.45424999999999999,0.80501,0.80501,149.68603999999999,0,0,0.16722546057253149,17.265621946390695,3.0471811215074278,4.0543917952241619,3.9273209987628821,429.68603999999999,55.199785481664861,0,0.9842581552238463,0.94461290563621803,1.1307843479014483,0.98405895900413387,0.98674671519920054,1.1294975678080683,0.9801098274443335,1,14.760692736045051,13.923826254762419,16.59670000684158,15.307739597923128,15.333411073578057,17.42082447922828,16.357737377930103,16.443608385676853,0.9842581552238463,0.94461290563621803,1.1307843479014483,0.98405895900413387,0.98674671519920054,1.1294975678080683,0.9801098274443335,1,14.760692736045051,13.923826254762419,16.59670000684158,15.307739597923128,15.333411073578057,17.42082447922828,16.357737377930103,16.443608385676853]
["24Region 4 - West","Region 4 - West",24,{"$f":"INDEX('2023 NIST (for reference)'!$J$3:$N$250,MATCH(Calculator!$C30&D$4,'2023 NIST (for reference)'!$A$3:$A$250,0),MATCH(Calculator!$B30,'2023 NIST (for reference)'!$J$2:$N$2,0))","v":0.99547424770603277},{"$f":"INDEX('2023 NIST (for reference)'!$J$3:$N$250,MATCH(Calculator!$C30&E$4,'2023 NIST (for reference)'!$A$3:$A$250,0),MATCH(Calculator!$B30,'2023 NIST (for reference)'!$J$2:$N$2,0))","v":0.8660605619031958},{"$f":"INDEX('2023 NIST (for reference)'!$J$3:$N$250,MATCH(Calculator!$C30&F$4,'2023 NIST (for reference)'!$A$3:$A$250,0),MATCH(Calculator!$B30,'2023 NIST (for reference)'!$J$2:$N$2,0))","v":1.0945935135443363},{"$f":"INDEX('2023 NIST (for reference)'!$J$3:$N$250,MATCH(Calculator!$C30&G$4,'2023 NIST (for reference)'!$A$3:$A$250,0),MATCH(Calculator!$B30,'2023 NIST (for reference)'!$J$2:$N$2,0))","v":0.9108789428130577},{"$f":"INDEX('2023 NIST (for reference)'!$J$3:$N$250,MATCH(Calculator!$C30&H$4,'2023 NIST (for reference)'!$A$3:$A$250,0),MATCH(Calculator!$B30,'2023 NIST (for reference)'!$J$2:$N$2,0))","v":0.9108789428130577},{"$f":"INDEX('2023 NIST (for reference)'!$J$3:$N$250,MATCH(Calculator!$C30&I$4,'2023 NIST (for reference)'!$A$3:$A$250,0),MATCH(Calculator!$B30,'2023 NIST (for reference)'!$J$2:$N$2,0))","v":1},{"$f":"INDEX('2023 NIST (for reference)'!$J$3:$N$250,MATCH(Calculator!$C30&J$4,'2023 NIST (for reference)'!$A$3:$A$250,0),MATCH(Calculator!$B30,'2023 NIST (for reference)'!$J$2:$N$2,0))","v":0.980564916387616},{"$f":"INDEX('2023 NIST (for reference)'!$J$3:$N$250,MATCH(Calculator!$C30&K$4,'2023 NIST (for reference)'!$A$3:$A$250,0),MATCH(Calculator!$B30,'2023 NIST (for reference)'!$J$2:$N$2,0))","v":1},15.228469713812739,13.172732589622024,16.682655343642043,15.026015464543377,15.026015464543377,16.935542122016361,16.840110340972103,16.935542122016361,{"$f":"D30+D31/(1+$C$4)+D32/(1+$C$4)^2+D33/(1+$C$4)^3+D34/(1+$C$4)^4+D35/(1+$C$4)^5+D36/(1+$C$4)^6","v":6.4536674224534094},5.6448818078190737,7.0755820982591091,5.8743275285842982,5.8743275285842982,6.4171914438781892,6.2986048529765206,6.4171914438781892,17.913539075929023,15.523595980424052,19.624905405124736,17.467703272470878,17.467703272470878,19.600441349469783,19.456233596981008,19.600441349469783,0.14932113715590492,13.311350836452119,2.6160784973709639,3.2609466152707465,3.1334235632769185,280,55.225416090950532,0,1.8599999999999998E-2,0.42327999999999999,0.46,0.81519999999999992,0.81519999999999992,151.58079999999998,0,0,0.16792113715590493,17.700764436452118,3.0760784973709638,4.076146615270746,3.9486235632769184,431.58079999999995,55.225416090950532,0,0.98835277902239516,0.96841982166733309,1.1415079311145613,0.98933916541970057,0.99209902420734275,1.1344782434929941,0.980564916387616,1,15.246896811451077,14.400224635980472,17.158246268455951,15.794428910075053,15.821458053375157,17.978912600345673,16.840110340972103,16.935542122016361,{"$f":"BH30+BH31/(1+$C$4)+BH32/(1+$C$4)^2+BH33/(1+$C$4)^3+BH34/(1+$C$4)^4+BH35/(1+$C$4)^5+BH36/(1+$C$4)^6","v":6.4002935504658378},6.3462810817867572,7.4123542413854793,6.4221432294747105,6.4414127895891449,7.3770856987033842,6.2986048529765206,6.4171914438781892,17.909213055995377,17.045776019186523,20.24308712387835,18.467008512106105,18.502159334465748,21.049861810288196,19.456233596981008,19.600441349469783]
["25Region 4 - West","Region 4 - West",25,{"$f":"INDEX('2023 NIST (for reference)'!$J$3:$N$250,MATCH(Calculator!$C31&D$4,'2023 NIST (for reference)'!$A$3:$A$250,0),MATCH(Calculator!$B31,'2023 NIST (for reference)'!$J$2:$N$2,0))","v":1.000108828427382},{"$f":"INDEX('2023 NIST (for reference)'!$J$3:$N$250,MATCH(Calculator!$C31&E$4,'2023 NIST (for reference)'!$A$3:$A$250,0),MATCH(Calculator!$B31,'2023 NIST (for reference)'!$J$2:$N$2,0))","v":0.86511488989641494},{"$f":"INDEX('2023 NIST (for reference)'!$J$3:$N$250,MATCH(Calculator!$C31&F$4,'2023 NIST (for reference)'!$A$3:$A$250,0),MATCH(Calculator!$B31,'2023 NIST (for reference)'!$J$2:$N$2,0))","v":1.096638909505822},{"$f":"INDEX('2023 NIST (for reference)'!$J$3:$N$250,MATCH(Calculator!$C31&G$4,'2023 NIST (for reference)'!$A$3:$A$250,0),MATCH(Calculator!$B31,'2023 NIST (for reference)'!$J$2:$N$2,0))","v":0.91189630607860472},{"$f":"INDEX('2023 NIST (for reference)'!$J$3:$N$250,MATCH(Calculator!$C31&H$4,'2023 NIST (for reference)'!$A$3:$A$250,0),MATCH(Calculator!$B31,'2023 NIST (for reference)'!$J$2:$N$2,0))","v":0.91189630607860472},{"$f":"INDEX('2023 NIST (for reference)'!$J$3:$N$250,MATCH(Calculator!$C31&I$4,'2023 NIST (for reference)'!$A$3:$A$250,0),MATCH(Calculator!$B31,'2023 NIST (for reference)'!$J$2:$N$2,0))","v":1},{"$f":"INDEX('2023 NIST (for reference)'!$J$3:$N$250,MATCH(Calculator!$C31&J$4,'2023 NIST (for reference)'!$A$3:$A$250,0),MATCH(Calculator!$B31,'2023 NIST (for reference)'!$J$2:$N$2,0))","v":0.98148075122989853},{"$f":"INDEX('2023 NIST (for reference)'!$J$3:$N$250,MATCH(Calculator!$C31&K$4,'2023 NIST (for reference)'!$A$3:$A$250,0),MATCH(Calculator!$B31,'2023 NIST (for reference)'!$J$2:$N$2,0))","v":1},15.706127260137411,13.585916279087739,17.206416194291059,15.461542218915653,15.461542218915653,17.41314769127802,17.308871013882619,17.41314769127802,{"$f":"(L31-L36)*(1+$C$4)^25","v":-4.6218301415624117},-4.0570709933969402,-5.0637793327503964,-4.2004557372657754,-4.2004557372657754,-4.5797071871945407,-4.4961003834566684,-4.5797071871945407,15.706127260137411,13.585916279087739,17.206416194291055,15.461542218915653,15.461542218915653,17.41314769127802,17.308871013882619,17.41314769127802,0.1500163242641073,13.296815857707896,2.6209669937189148,3.2645887757614052,3.1369232929104003,280,55.276995909267889,0,1.8599999999999998E-2,0.42857099999999998,0.46575,0.82538999999999996,0.82538999999999996,153.47555999999997,0,0,0.1686163242641073,17.741097127707896,3.0867169937189147,4.0899787757614048,3.9623132929104004,433.47555999999997,55.276995909267889,0,0.99244452186054921,0.97062644826888522,1.1454557913420225,0.99269642888625786,0.99553859427356817,1.1394589191779199,0.98148075122989864,1,15.720893842274899,14.863801233346356,17.705322333743922,16.268546253097291,16.296932830415138,18.523124526089919,17.308871013882619,17.41314769127802,{"$f":"(BP31-BP36)*(1+$C$4)^25","v":-4.5818544727261985},-4.568570649654121,-5.313515908237024,-4.6030917570904002,-4.6172545840696948,-5.2904267596887777,-4.4961003834566755,-4.5797071871945407,15.720893842274899,14.863801233346356,17.705322333743922,16.268546253097291,16.296932830415134,18.523124526089919,17.308871013882616,17.41314769127802]
["26Region 4 - West","Region 4 - West",26,{"$f":"INDEX('2023 NIST (for reference)'!$J$3:$N$250,MATCH(Calculator!$C32&D$4,'2023 NIST (for reference)'!$A$3:$A$250,0),MATCH(Calculator!$B32,'2023 NIST (for reference)'!$J$2:$N$2,0))","v":1.0030568524386769},{"$f":"INDEX('2023 NIST (for reference)'!$J$3:$N$250,MATCH(Calculator!$C32&E$4,'2023 NIST (for reference)'!$A$3:$A$250,0),MATCH(Calculator!$B32,'2023 NIST (for reference)'!$J$2:$N$2,0))","v":0.86482196439390613},{"$f":"INDEX('2023 NIST (for reference)'!$J$3:$N$250,MATCH(Calculator!$C32&F$4,'2023 NIST (for reference)'!$A$3:$A$250,0),MATCH(Calculator!$B32,'2023 NIST (for reference)'!$J$2:$N$2,0))","v":1.0978007319710439},{"$f":"INDEX('2023 NIST (for reference)'!$J$3:$N$250,MATCH(Calculator!$C32&G$4,'2023 NIST (for reference)'!$A$3:$A$250,0),MATCH(Calculator!$B32,'2023 NIST (for reference)'!$J$2:$N$2,0))","v":0.91371879862471594},{"$f":"INDEX('2023 NIST (for reference)'!$J$3:$N$250,MATCH(Calculator!$C32&H$4,'2023 NIST (for reference)'!$A$3:$A$250,0),MATCH(Calculator!$B32,'2023 NIST (for reference)'!$J$2:$N$2,0))","v":0.91371879862471594},{"$f":"INDEX('2023 NIST (for reference)'!$J$3:$N$250,MATCH(Calculator!$C32&I$4,'2023 NIST (for reference)'!$A$3:$A$250,0),MATCH(Calculator!$B32,'2023 NIST (for reference)'!$J$2:$N$2,0))","v":1},{"$f":"INDEX('2023 NIST (for reference)'!$J$3:$N$250,MATCH(Calculator!$C32&J$4,'2023 NIST (for reference)'!$A$3:$A$250,0),MATCH(Calculator!$B32,'2023 NIST (for reference)'!$J$2:$N$2,0))","v":0.98199346216941363},{"$f":"INDEX('2023 NIST (for reference)'!$J$3:$N$250,MATCH(Calculator!$C32&K$4,'2023 NIST (for reference)'!$A$3:$A$250,0),MATCH(Calculator!$B32,'2023 NIST (for reference)'!$J$2:$N$2,0))","v":1},16.171239433934286,13.986929664150203,17.715460605484161,15.885228808199379,15.885228808199379,17.876842418716524,17.764216204669658,17.876842418716524,"Upper cells show FPI to be used in v8.9 for year 24 to mimic \"year 30 UPV\"",null,null,null,null,null,null,null,"Upper cells verify that year 24 FPI results in \"year 30 UPV\"",null,null,null,null,null,null,null,0.15045852786580152,13.292313592734336,2.6237437494107949,3.2711132990764833,3.1431926672690227,280,55.305871789381378,0,1.8599999999999998E-2,0.43386199999999997,0.47150000000000003,0.83557999999999999,0.83557999999999999,155.37031999999999,0,0,0.16905852786580153,17.791462532734336,3.0952437494107947,4.1066932990764835,3.9787726672690225,435.37031999999999,55.305871789381378,0,0.99504725053444099,0.97338197087521194,1.1486200016368104,0.99675328309385114,0.99967404273518368,1.1444395948628456,0.98199346216941363,1,16.1822920058999,15.315153321024892,18.237931372333318,16.730735495024931,16.760476413188577,19.05379513209968,17.764216204669658,17.876842418716524,{"$f":"T32","v":"Upper cells show FPI to be used in v8.9 for year 24 to mimic \"year 30 UPV\""},null,null,null,null,null,null,null,{"$f":"AB32","v":"Upper cells verify that year 24 FPI results in \"year 30 UPV\""}]
["27Region 4 - West","Region 4 - West",27,{"$f":"INDEX('2023 NIST (for reference)'!$J$3:$N$250,MATCH(Calculator!$C33&D$4,'2023 NIST (for reference)'!$A$3:$A$250,0),MATCH(Calculator!$B33,'2023 NIST (for reference)'!$J$2:$N$2,0))","v":1.0051084138858204},{"$f":"INDEX('2023 NIST (for reference)'!$J$3:$N$250,MATCH(Calculator!$C33&E$4,'2023 NIST (for reference)'!$A$3:$A$250,0),MATCH(Calculator!$B33,'2023 NIST (for reference)'!$J$2:$N$2,0))","v":0.86542230403108378},{"$f":"INDEX('2023 NIST (for reference)'!$J$3:$N$250,MATCH(Calculator!$C33&F$4,'2023 NIST (for reference)'!$A$3:$A$250,0),MATCH(Calculator!$B33,'2023 NIST (for reference)'!$J$2:$N$2,0))","v":1.0975437921934124},{"$f":"INDEX('2023 NIST (for reference)'!$J$3:$N$250,MATCH(Calculator!$C33&G$4,'2023 NIST (for reference)'!$A$3:$A$250,0),MATCH(Calculator!$B33,'2023 NIST (for reference)'!$J$2:$N$2,0))","v":0.91430025147387284},{"$f":"INDEX('2023 NIST (for reference)'!$J$3:$N$250,MATCH(Calculator!$C33&H$4,'2023 NIST (for reference)'!$A$3:$A$250,0),MATCH(Calculator!$B33,'2023 NIST (for reference)'!$J$2:$N$2,0))","v":0.91430025147387284},{"$f":"INDEX('2023 NIST (for reference)'!$J$3:$N$250,MATCH(Calculator!$C33&I$4,'2023 NIST (for reference)'!$A$3:$A$250,0),MATCH(Calculator!$B33,'2023 NIST (for reference)'!$J$2:$N$2,0))","v":1},{"$f":"INDEX('2023 NIST (for reference)'!$J$3:$N$250,MATCH(Calculator!$C33&J$4,'2023 NIST (for reference)'!$A$3:$A$250,0),MATCH(Calculator!$B33,'2023 NIST (for reference)'!$J$2:$N$2,0))","v":0.98155986475863388},{"$f":"INDEX('2023 NIST (for reference)'!$J$3:$N$250,MATCH(Calculator!$C33&K$4,'2023 NIST (for reference)'!$A$3:$A$250,0),MATCH(Calculator!$B33,'2023 NIST (for reference)'!$J$2:$N$2,0))","v":1},16.623728241723541,14.376533314040394,18.209562808953041,16.296836775096597,16.296836775096597,18.327031474482062,18.206103713362698,18.327031474482062,"Lower cells show FPI to be used in v8.9 for year 25 to mimic back \"year 25 UPV\"",null,null,null,null,null,null,null,"Lower cells verify that year 25 FPI results in \"year 25 UPV\"",null,null,null,null,null,null,null,0.15076626208287305,13.301540812957757,2.6231296633422558,3.2731949002764646,3.1451928650701224,280,55.281451583206263,0,1.8599999999999998E-2,0.44444400000000001,0.48300000000000004,0.85596000000000005,0.85596000000000005,159.15984,0,0,0.16936626208287306,17.910425092957759,3.1061296633422559,4.1291549002764647,4.0011528650701225,439.15984000000003,55.281451583206263,0,0.99685851726234886,0.97989048646900223,1.1526596765348385,1.0022050354184431,1.0052971091136895,1.1544009462326972,0.98155986475863388,1,16.63106680051807,15.756289293882007,18.756846143731547,17.181917233603428,17.213050169504296,19.573493804059023,18.206103713362698,18.327031474482062,{"$f":"T33","v":"Lower cells show FPI to be used in v8.9 for year 25 to mimic back \"year 25 UPV\""},null,null,null,null,null,null,null,{"$f":"AB33","v":"Lower cells verify that year 25 FPI results in \"year 25 UPV\""}]
["28Region 4 - West","Region 4 - West",28,{"$f":"INDEX('2023 NIST (for reference)'!$J$3:$N$250,MATCH(Calculator!$C34&D$4,'2023 NIST (for reference)'!$A$3:$A$250,0),MATCH(Calculator!$B34,'2023 NIST (for reference)'!$J$2:$N$2,0))","v":1.0087487478964019},{"$f":"INDEX('2023 NIST (for reference)'!$J$3:$N$250,MATCH(Calculator!$C34&E$4,'2023 NIST (for reference)'!$A$3:$A$250,0),MATCH(Calculator!$B34,'2023 NIST (for reference)'!$J$2:$N$2,0))","v":0.88061034203686706},{"$f":"INDEX('2023 NIST (for reference)'!$J$3:$N$250,MATCH(Calculator!$C34&F$4,'2023 NIST (for reference)'!$A$3:$A$250,0),MATCH(Calculator!$B34,'2023 NIST (for reference)'!$J$2:$N$2,0))","v":1.1034614285369622},{"$f":"INDEX('2023 NIST (for reference)'!$J$3:$N$250,MATCH(Calculator!$C34&G$4,'2023 NIST (for reference)'!$A$3:$A$250,0),MATCH(Calculator!$B34,'2023 NIST (for reference)'!$J$2:$N$2,0))","v":0.91655010305897155},{"$f":"INDEX('2023 NIST (for reference)'!$J$3:$N$250,MATCH(Calculator!$C34&H$4,'2023 NIST (for reference)'!$A$3:$A$250,0),MATCH(Calculator!$B34,'2023 NIST (for reference)'!$J$2:$N$2,0))","v":0.91655010305897155},{"$f":"INDEX('2023 NIST (for reference)'!$J$3:$N$250,MATCH(Calculator!$C34&I$4,'2023 NIST (for reference)'!$A$3:$A$250,0),MATCH(Calculator!$B34,'2023 NIST (for reference)'!$J$2:$N$2,0))","v":1},{"$f":"INDEX('2023 NIST (for reference)'!$J$3:$N$250,MATCH(Calculator!$C34&J$4,'2023 NIST (for reference)'!$A$3:$A$250,0),MATCH(Calculator!$B34,'2023 NIST (for reference)'!$J$2:$N$2,0))","v":0.98152973322541404},{"$f":"INDEX('2023 NIST (for reference)'!$J$3:$N$250,MATCH(Calculator!$C34&K$4,'2023 NIST (for reference)'!$A$3:$A$250,0),MATCH(Calculator!$B34,'2023 NIST (for reference)'!$J$2:$N$2,0))","v":1},17.064628869218833,14.761427623146165,18.691860147386777,16.697439518259632,16.697439518259632,18.764108227652489,18.635107542301096,18.764108227652489,null,null,null,null,null,null,null,null,null,null,null,null,null,null,null,null,0.15131231218446028,13.534980957106646,2.6372728142033397,3.2812493689511184,3.152932354522862,280,55.279754575255318,0,1.8599999999999998E-2,0.449735,0.48875000000000002,0.86614999999999998,0.86614999999999998,161.05459999999999,0,0,0.16991231218446029,18.198732907106645,3.1260228142033397,4.1473993689511186,4.0190823545228618,441.05459999999999,55.279754575255318,0,1.0000724672422618,0.99566398613709484,1.1600418644413544,1.0066332292779294,1.0098019267306508,1.1593816219176227,0.98152973322541404,1,17.068175227435454,16.191470876191531,19.263873475383342,17.621893217089685,17.654411116984967,20.080232559052238,18.635107542301096,18.764108227652489]
["29Region 4 - West","Region 4 - West",29,{"$f":"INDEX('2023 NIST (for reference)'!$J$3:$N$250,MATCH(Calculator!$C35&D$4,'2023 NIST (for reference)'!$A$3:$A$250,0),MATCH(Calculator!$B35,'2023 NIST (for reference)'!$J$2:$N$2,0))","v":1.0129567920772675},{"$f":"INDEX('2023 NIST (for reference)'!$J$3:$N$250,MATCH(Calculator!$C35&E$4,'2023 NIST (for reference)'!$A$3:$A$250,0),MATCH(Calculator!$B35,'2023 NIST (for reference)'!$J$2:$N$2,0))","v":0.90102954486751574},{"$f":"INDEX('2023 NIST (for reference)'!$J$3:$N$250,MATCH(Calculator!$C35&F$4,'2023 NIST (for reference)'!$A$3:$A$250,0),MATCH(Calculator!$B35,'2023 NIST (for reference)'!$J$2:$N$2,0))","v":1.111599717741494},{"$f":"INDEX('2023 NIST (for reference)'!$J$3:$N$250,MATCH(Calculator!$C35&G$4,'2023 NIST (for reference)'!$A$3:$A$250,0),MATCH(Calculator!$B35,'2023 NIST (for reference)'!$J$2:$N$2,0))","v":0.9195289521830825},{"$f":"INDEX('2023 NIST (for reference)'!$J$3:$N$250,MATCH(Calculator!$C35&H$4,'2023 NIST (for reference)'!$A$3:$A$250,0),MATCH(Calculator!$B35,'2023 NIST (for reference)'!$J$2:$N$2,0))","v":0.9195289521830825},{"$f":"INDEX('2023 NIST (for reference)'!$J$3:$N$250,MATCH(Calculator!$C35&I$4,'2023 NIST (for reference)'!$A$3:$A$250,0),MATCH(Calculator!$B35,'2023 NIST (for reference)'!$J$2:$N$2,0))","v":1},{"$f":"INDEX('2023 NIST (for reference)'!$J$3:$N$250,MATCH(Calculator!$C35&J$4,'2023 NIST (for reference)'!$A$3:$A$250,0),MATCH(Calculator!$B35,'2023 NIST (for reference)'!$J$2:$N$2,0))","v":0.98172216242250709},{"$f":"INDEX('2023 NIST (for reference)'!$J$3:$N$250,MATCH(Calculator!$C35&K$4,'2023 NIST (for reference)'!$A$3:$A$250,0),MATCH(Calculator!$B35,'2023 NIST (for reference)'!$J$2:$N$2,0))","v":1},17.494473399105299,15.143776232836768,19.163563443945627,17.087638284149325,17.087638284149325,19.188454589953874,19.051697770715734,19.188454589953874,null,null,null,null,null,null,null,null,null,null,null,null,null,null,null,null,0.15194351881159013,13.848824104613715,2.6567233254021709,3.2919136488154352,3.1631795955098037,280,55.290592187635603,0,1.8599999999999998E-2,{"$f":"AS34","v":0.449735},{"$f":"AT34","v":0.48875000000000002},{"$f":"AU34","v":0.86614999999999998},{"$f":"AV34","v":0.86614999999999998},{"$f":"AW34","v":161.05459999999999},0,0,0.17054351881159013,18.512576054613717,3.1454733254021709,4.1580636488154354,4.0293295955098039,441.05459999999999,55.290592187635603,0,1.0037876327933499,1.0128345397610057,1.167259792337757,1.0092216027435057,1.0123765651131271,1.1593816219176227,0.98172216242250721,1,17.494128857934431,16.621263528752309,19.759195922122537,18.050152732969863,18.084009429669894,20.572211932832058,19.051697770715737,19.188454589953874]
["30Region 4 - West","Region 4 - West",30,{"$f":"INDEX('2023 NIST (for reference)'!$J$3:$N$250,MATCH(Calculator!$C36&D$4,'2023 NIST (for reference)'!$A$3:$A$250,0),MATCH(Calculator!$B36,'2023 NIST (for reference)'!$J$2:$N$2,0))","v":1.017182390317918},{"$f":"INDEX('2023 NIST (for reference)'!$J$3:$N$250,MATCH(Calculator!$C36&E$4,'2023 NIST (for reference)'!$A$3:$A$250,0),MATCH(Calculator!$B36,'2023 NIST (for reference)'!$J$2:$N$2,0))","v":0.92192221913534389},{"$f":"INDEX('2023 NIST (for reference)'!$J$3:$N$250,MATCH(Calculator!$C36&F$4,'2023 NIST (for reference)'!$A$3:$A$250,0),MATCH(Calculator!$B36,'2023 NIST (for reference)'!$J$2:$N$2,0))","v":1.119798028755093},{"$f":"INDEX('2023 NIST (for reference)'!$J$3:$N$250,MATCH(Calculator!$C36&G$4,'2023 NIST (for reference)'!$A$3:$A$250,0),MATCH(Calculator!$B36,'2023 NIST (for reference)'!$J$2:$N$2,0))","v":0.92251748276604073},{"$f":"INDEX('2023 NIST (for reference)'!$J$3:$N$250,MATCH(Calculator!$C36&H$4,'2023 NIST (for reference)'!$A$3:$A$250,0),MATCH(Calculator!$B36,'2023 NIST (for reference)'!$J$2:$N$2,0))","v":0.92251748276604073},{"$f":"INDEX('2023 NIST (for reference)'!$J$3:$N$250,MATCH(Calculator!$C36&I$4,'2023 NIST (for reference)'!$A$3:$A$250,0),MATCH(Calculator!$B36,'2023 NIST (for reference)'!$J$2:$N$2,0))","v":1},{"$f":"INDEX('2023 NIST (for reference)'!$J$3:$N$250,MATCH(Calculator!$C36&J$4,'2023 NIST (for reference)'!$A$3:$A$250,0),MATCH(Calculator!$B36,'2023 NIST (for reference)'!$J$2:$N$2,0))","v":0.98191462934540152},{"$f":"INDEX('2023 NIST (for reference)'!$J$3:$N$250,MATCH(Calculator!$C36&K$4,'2023 NIST (for reference)'!$A$3:$A$250,0),MATCH(Calculator!$B36,'2023 NIST (for reference)'!$J$2:$N$2,0))","v":1},17.913539075929023,15.523595980424052,19.624905405124739,17.467703272470878,17.467703272470878,19.600441349469783,19.456233596981008,19.600441349469783,null,null,null,null,null,null,null,null,null,null,null,null,null,null,null,null,0.1525773585476877,14.169944508110234,2.6763172887246727,3.3026125883024258,3.1734601407151799,280,55.301431924733016,0,1.8599999999999998E-2,0.449735,0.48875000000000002,0.86614999999999998,0.86614999999999998,{"$f":"AW35","v":161.05459999999999},0,0,0.1711773585476877,18.833696458110232,3.1650672887246727,4.1687625883024255,4.0396101407151797,441.05459999999999,55.301431924733016,0,1.0075182963371849,1.0304032365822242,1.1745309541607469,1.011818388595928,1.0149595712425108,1.1593816219176227,0.98191462934540152,1,17.909213055995377,17.045776019186523,20.24308712387835,18.467008512106105,18.502159334465752,21.049861810288196,19.456233596981011,19.600441349469783]
[]
[]
[]
[]
[]
[null,null,null,null,null,null,null,null,null,null,null,null,null,null,null,null,null,null,null,null,null,null,null,null,null,null,"All states names ->","US","Alabama","Alaska","Arizona","Arkansas","California","Colorado","Connecticut","Delaware","District of Columbia","Florida","Georgia","Hawaii","Idaho","Illinois","Indiana","Iowa","Kansas","Kentucky","Louisiana","Maine","Maryland","Massachusetts","Michigan","Minnesota","Mississippi","Missouri","Montana","Nebraska","Nevada","New Hampshire","New Jersey","New Mexico","New York","North Carolina","North Dakota","Ohio","Oklahoma","Oregon","Pennsylvania","Rhode Island","South Carolina","South Dakota","Tennessee","Texas","Utah","Vermont","Virginia","Washington","West Virginia","Wisconsin","Wyoming"]
[null,null,null,null,null,null,null,null,null,null,null,null,null,null,null,null,null,null,null,null,null,null,null,null,null,null,null,"Region Name"]
[null,null,null,null,null,null,null,null,null,null,null,null,null,null,null,null,null,null,null,null,null,null,null,null,null,null,null,"Region 1 - Northeast","Connecticut"," Maine"," Massachusetts"," New Hampshire"," New Jersey"," New York"," Pennsylvania"," Rhode Island"," Vermont"]
[null,null,null,null,null,null,null,null,null,null,null,null,null,null,null,null,null,null,null,null,null,null,null,null,null,null,null,null,"CT","ME","MA","NH","NJ","NY","PA","RI","VT"]
[null,null,null,null,null,null,null,null,null,null,null,null,null,null,null,null,null,null,null,null,null,null,null,null,null,null,null,"Region 2 - Midwest","Illinois"," Indiana"," Iowa"," Kansas"," Michigan"," Minnesota"," Missouri"," Nebraska"," North Dakota"," Ohio"," South Dakota"," Wisconsin"]
[null,null,null,null,null,null,null,null,null,null,null,null,null,null,null,null,null,null,null,null,null,null,null,null,null,null,null,null,"IL","IN","IA","KS","MI","MN","MO","NE","ND","OH","SD","WI"]
[]
[]
[null,null,null,null,null,null,null,null,null,null,null,null,null,null,null,null,null,null,null,null,null,null,null,null,null,null,null,"Region 3 - South","Alabama"," Arkansas"," Delaware"," District of Columbia"," Florida"," Georgia"," Kentucky"," Louisiana"," Maryland"," Mississippi"," North Carolina"," Oklahoma"," South Carolina"," Tennessee"," Texas"," Virginia"," West Virginia"]
[null,null,null,null,null,null,null,null,null,null,null,null,null,null,null,null,null,null,null,null,null,null,null,null,null,null,null,null,"AL","AK","DE",null,"FL","GA","KY","LA","MD","MS","NC","OK","SC","TN","TX","VA","WV"]
[]
[]
[null,null,null,null,null,null,null,null,null,null,null,null,null,null,null,null,null,null,null,null,null,null,null,null,null,null,null,"Region 4 - West","Alaska"," Arizona"," California"," Colorado"," Hawaii"," Idaho"," Montana"," Nevada"," New Mexico"," Oregon"," Utah"," Washington"," Wyoming"]
[null,null,null,null,null,null,null,null,null,null,null,null,null,null,null,null,null,null,null,null,null,null,null,null,null,null,null,null,"AK","AZ","CA","CO","HI","ID","MT","NV","NM","OR","UT","WA","WY"]
[]
[]
[null,null,null,null,null,null,null,null,null,null,null,null,null,null,null,null,null,null,null,null,null,null,null,null,null,null,null,"Region 5 - US","US"]
[]
[]
[null,null,null,null,null,null,null,null,null,null,null,null,null,null,null,null,null,null,null,null,null,null,null,null,null,null,null,"IF(OR(I5='User Inputs'!AC44:AK44,\"Region 1 - Northeast\"),IF(OR(I5='User Inputs'!AC46:AN46),\"Region 2 - Midwest\",IF(OR(I5='User Inputs'!AC50:AS50),\"Region 3 - South\",IF(OR(I5='User Inputs'!AC54:AO54),\"Region 4 - West\",IF(OR(I5='User Inputs'!AC58),\"Region 5 - US\")))))"]
[]
[null,null,null,null,null,null,null,null,null,null,null,null,null,null,null,null,null,null,null,null,null,null,null,null,null,null,null,"IF(OR(SUMPRODUCT((I5='User Inputs'!AC44:AK44))),\"Region 1 - Northeast\", IF(OR(SUMPRODUCT((I5='User Inputs'!AC46:AN46))),\"Region 2 - Midwest\", IF(OR(SUMPRODUCT((I5='User Inputs'!AC50:AS50))),\"Region 3 - South\", IF(OR(SUMPRODUCT((I5='User Inputs'!AC54:AO54))),\"Region 4 - West\", IF(OR(I5='User Inputs'!AC58),\"Region 5 - US\",\"\")))))"]
[]
[null,null,null,null,null,null,null,null,null,null,null,null,null,null,null,null,null,null,null,null,null,null,null,null,null,null,null,"IF(ISNUMBER(MATCH(I5,'User Inputs'!AC44:AK44,0)),\"Region 1 - Northeast\", IF(ISNUMBER(MATCH(I5,'User Inputs'!AC46:AN46,0)),\"Region 2 - Midwest\", IF(ISNUMBER(MATCH(I5,'User Inputs'!AC50:AS50,0)),\"Region 3 - South\", IF(ISNUMBER(MATCH(I5,'User Inputs'!AC54:AO54,0)),\"Region 4 - West\", IF(ISNUMBER(MATCH(I5,'User Inputs'!AC58,0)),\"Region 5 - US\",\"\")))))"]
[]
[null,null,null,null,null,null,null,null,null,null,null,null,null,null,null,null,null,null,null,null,null,null,null,null,null,null,null,"CHOOSE(MATCH(I5, CHOOSE({1,2,3,4,5}, Calculator!AC44:AK44, Calculator!AC46:AN46, Calculator!AC50:AS50, Calculator!AC54:AO54, Calculator!AC58), 0), \"Region 1 - Northeast\", \"Region 2 - Midwest\", \"Region 3 - South\", \"Region 4 - West\", \"Region 5 - US\")"]
[]
[null,null,null,null,null,null,null,null,null,null,null,null,null,null,null,null,null,null,null,null,null,null,null,null,null,null,null,"INDEX(Calculator!$AC$44:$AS$58, MATCH(I5, Calculator!$AB$44:$AB$58, 0))"]
[]
[null,null,null,null,null,null,null,null,null,null,null,null,null,null,null,null,null,null,null,null,null,null,null,null,null,null,null,"INDEX(Calculator!$AB$44:$AB$58, MATCH('User Inputs'!I5, Calculator!$AC$44:$AS$58, 0))"]
[]
[null,null,null,null,null,null,null,null,null,null,null,null,null,null,null,null,null,null,null,null,null,null,null,null,null,null,null,"INDIRECT(\"'Calculator'!AB44:AB58\" & MATCH(I5, Calculator!AC44:AS58, 0))"]

{"sheet":"Diagram","index":5,"n_rows":27,"n_cols":4,"rows_kept":27,"cut":false,"hidden":true,"merged":[]}
[]
[]
[]
[]
[]
[]
[null,null,"WPN 22-10"]
[]
[]
[]
[]
[]
[]
[]
[]
[]
[]
[]
[null,null,"Annual Supplement to "]
[null,null,"NIST Handbook 135"]
[]
[]
[]
[]
[]
[null,null,null,"Extrapolated modified fuel prices = Fuel Price entered + (Fuel cost modifier * Heat content * 10) "]
[null,null,null,"Projected real FPIs from the Annula Supplement to National Institute of Standards and Technology (NIST) Handbook 135."]

{"sheet":"WPN 22-10","index":6,"n_rows":38,"n_cols":10,"rows_kept":38,"cut":false,"hidden":true,"merged":[[11,9,14,9],[8,9,9,9]]}
[]
[]
[]
[]
[]
[]
[]
[]
[null,null,null,null,null,null,null,null,null,"Wood"]
[]
[]
[null,null,null,null,null,null,null,null,null,"93.08 kg CO2/MMBtu"]
[]
[]
[]
[]
[53,null,null,null,null,null,null,null,null,{"$f":"93.08*A17/10000","v":0.49332399999999998}]
[54,null,null,null,null,null,null,null,null,{"$f":"93.08*A18/10000","v":0.50263199999999997}]
[55,null,null,null,null,null,null,null,null,0.51193999999999995]
[56,null,null,null,null,null,null,null,null,0.52124799999999993]
[57,null,null,null,null,null,null,null,null,0.53055599999999992]
[59,null,null,null,null,null,null,null,null,0.54917199999999999]
[60,null,null,null,null,null,null,null,null,0.55847999999999998]
[61,null,null,null,null,null,null,null,null,0.56778799999999996]
[62,null,null,null,null,null,null,null,null,0.57709600000000005]
[63,null,null,null,null,null,null,null,null,0.58640400000000004]
[64,null,null,null,null,null,null,null,null,0.59571200000000002]
[65,null,null,null,null,null,null,null,null,0.60502]
[66,null,null,null,null,null,null,null,null,0.61432799999999999]
[67,null,null,null,null,null,null,null,null,0.62363599999999997]
[69,null,null,null,null,null,null,null,null,0.64225199999999993]
[70,null,null,null,null,null,null,null,null,0.65155999999999992]
[71,null,null,null,null,null,null,null,null,0.66086800000000001]
[72,null,null,null,null,null,null,null,null,0.67017599999999999]
[73,null,null,null,null,null,null,null,null,0.67948399999999998]
[74,null,null,null,null,null,null,null,null,0.68879199999999996]
[75,null,null,null,null,null,null,null,null,0.69810000000000005]
[77,null,null,null,null,null,null,null,null,0.71671600000000002]

{"sheet":"Results_convert_json","index":7,"n_rows":249,"n_cols":6,"rows_kept":249,"cut":false,"hidden":true,"merged":[]}
["baseyear","censusregion","fuel_escalation_rates","fuel_type_id","fuel_name","rate"]
[2023,{"$f":"IF('User Inputs_FPI_Calculator'!I5=\"Region 1 - Northeast\", 1, IF('User Inputs_FPI_Calculator'!I5=\"Region 2 - Midwest\", 2, IF('User Inputs_FPI_Calculator'!I5=\"Region 3 - South\", 3, IF('User Inputs_FPI_Calculator'!I5=\"Region 4 - West\", 4, IF('User Inputs_FPI_Calculator'!I5=\"Region 5 - US\", 5, \"\")))))","v":4},null,{"$f":"IF('User Inputs_FPI_Calculator'!E3 = \"FPI for v8.9 (adjusted for 30 yr UPV)\", 1, IF('User Inputs_FPI_Calculator'!E3 =  \"FPI_SCC for v8.9 (adjusted for 30 year UPV)\", 1, IF('User Inputs_FPI_Calculator'!E3 = \"FPI for v10\", 3, IF('User Inputs_FPI_Calculator'!E3 = \"FPI_SCC for v10\", 3, \"\"))))","v":1},{"$f":"'User Inputs_FPI_Calculator'!AF3","v":"Natural Gas"},{"$f":"'User Inputs_FPI_Calculator'!AH3","v":1}]
[null,null,null,null,{"$f":"'User Inputs_FPI_Calculator'!AF4","v":"Natural Gas"},{"$f":"'User Inputs_FPI_Calculator'!AH4","v":0.98644692290046421}]
[null,null,null,null,{"$f":"'User Inputs_FPI_Calculator'!AF5","v":"Natural Gas"},{"$f":"'User Inputs_FPI_Calculator'!AH5","v":0.93139274010388873}]
[null,null,null,null,{"$f":"'User Inputs_FPI_Calculator'!AF6","v":"Natural Gas"},{"$f":"'User Inputs_FPI_Calculator'!AH6","v":0.87012329782988573}]
[null,null,null,null,{"$f":"'User Inputs_FPI_Calculator'!AF7","v":"Natural Gas"},{"$f":"'User Inputs_FPI_Calculator'!AH7","v":0.81951711053496357}]
[null,null,null,null,{"$f":"'User Inputs_FPI_Calculator'!AF8","v":"Natural Gas"},{"$f":"'User Inputs_FPI_Calculator'!AH8","v":0.7808202045643523}]
[null,null,null,null,{"$f":"'User Inputs_FPI_Calculator'!AF9","v":"Natural Gas"},{"$f":"'User Inputs_FPI_Calculator'!AH9","v":0.77264524240858889}]
[null,null,null,null,{"$f":"'User Inputs_FPI_Calculator'!AF10","v":"Natural Gas"},{"$f":"'User Inputs_FPI_Calculator'!AH10","v":0.77671981530962486}]
[null,null,null,null,{"$f":"'User Inputs_FPI_Calculator'!AF11","v":"Natural Gas"},{"$f":"'User Inputs_FPI_Calculator'!AH11","v":0.78415816838761399}]
[null,null,null,null,{"$f":"'User Inputs_FPI_Calculator'!AF12","v":"Natural Gas"},{"$f":"'User Inputs_FPI_Calculator'!AH12","v":0.79201650970829895}]
[null,null,null,null,{"$f":"'User Inputs_FPI_Calculator'!AF13","v":"Natural Gas"},{"$f":"'User Inputs_FPI_Calculator'!AH13","v":0.80241362423890805}]
[null,null,null,null,{"$f":"'User Inputs_FPI_Calculator'!AF14","v":"Natural Gas"},{"$f":"'User Inputs_FPI_Calculator'!AH14","v":0.81358988591630232}]
[null,null,null,null,{"$f":"'User Inputs_FPI_Calculator'!AF15","v":"Natural Gas"},{"$f":"'User Inputs_FPI_Calculator'!AH15","v":0.82402253842054884}]
[null,null,null,null,{"$f":"'User Inputs_FPI_Calculator'!AF16","v":"Natural Gas"},{"$f":"'User Inputs_FPI_Calculator'!AH16","v":0.83055121890129313}]
[null,null,null,null,{"$f":"'User Inputs_FPI_Calculator'!AF17","v":"Natural Gas"},{"$f":"'User Inputs_FPI_Calculator'!AH17","v":0.83997837981443046}]
[null,null,null,null,{"$f":"'User Inputs_FPI_Calculator'!AF18","v":"Natural Gas"},{"$f":"'User Inputs_FPI_Calculator'!AH18","v":0.84964100190581904}]
[null,null,null,null,{"$f":"'User Inputs_FPI_Calculator'!AF19","v":"Natural Gas"},{"$f":"'User Inputs_FPI_Calculator'!AH19","v":0.85317975071429641}]
[null,null,null,null,{"$f":"'User Inputs_FPI_Calculator'!AF20","v":"Natural Gas"},{"$f":"'User Inputs_FPI_Calculator'!AH20","v":0.85943128439233796}]
[null,null,null,null,{"$f":"'User Inputs_FPI_Calculator'!AF21","v":"Natural Gas"},{"$f":"'User Inputs_FPI_Calculator'!AH21","v":0.8672776264642148}]
[null,null,null,null,{"$f":"'User Inputs_FPI_Calculator'!AF22","v":"Natural Gas"},{"$f":"'User Inputs_FPI_Calculator'!AH22","v":0.87270542680714147}]
[null,null,null,null,{"$f":"'User Inputs_FPI_Calculator'!AF23","v":"Natural Gas"},{"$f":"'User Inputs_FPI_Calculator'!AH23","v":0.87547526337418469}]
[null,null,null,null,{"$f":"'User Inputs_FPI_Calculator'!AF24","v":"Natural Gas"},{"$f":"'User Inputs_FPI_Calculator'!AH24","v":0.87901817156262307}]
[null,null,null,null,{"$f":"'User Inputs_FPI_Calculator'!AF25","v":"Natural Gas"},{"$f":"'User Inputs_FPI_Calculator'!AH25","v":0.88505529277528905}]
[null,null,null,null,{"$f":"'User Inputs_FPI_Calculator'!AF26","v":"Natural Gas"},{"$f":"'User Inputs_FPI_Calculator'!AH26","v":0.94461290563621803}]
[null,null,null,null,{"$f":"'User Inputs_FPI_Calculator'!AF27","v":"Natural Gas"},{"$f":"'User Inputs_FPI_Calculator'!AH27","v":6.3462810817867572}]
[null,null,null,null,{"$f":"'User Inputs_FPI_Calculator'!AF28","v":"Natural Gas"},{"$f":"'User Inputs_FPI_Calculator'!AH28","v":-4.568570649654121}]
[null,null,null,{"$f":"IF('User Inputs_FPI_Calculator'!E3= \"FPI for v8.9 (adjusted for 30 yr UPV)\", 2, IF('User Inputs_FPI_Calculator'!E3= \"FPI_SCC for v8.9 (adjusted for 30 year UPV)\",2, \"\"))","v":2},{"$f":"'User Inputs_FPI_Calculator'!AF29","v":"Oil"},{"$f":"'User Inputs_FPI_Calculator'!AH29","v":1}]
[null,null,null,null,{"$f":"'User Inputs_FPI_Calculator'!AF30","v":"Oil"},{"$f":"'User Inputs_FPI_Calculator'!AH30","v":0.96744096993821582}]
[null,null,null,null,{"$f":"'User Inputs_FPI_Calculator'!AF31","v":"Oil"},{"$f":"'User Inputs_FPI_Calculator'!AH31","v":0.9296191683567282}]
[null,null,null,null,{"$f":"'User Inputs_FPI_Calculator'!AF32","v":"Oil"},{"$f":"'User Inputs_FPI_Calculator'!AH32","v":0.9115323557019096}]
[null,null,null,null,{"$f":"'User Inputs_FPI_Calculator'!AF33","v":"Oil"},{"$f":"'User Inputs_FPI_Calculator'!AH33","v":0.90150938135162406}]
[null,null,null,{"$f":"IF('User Inputs_FPI_Calculator'!E3= \"FPI for v10\", 1, IF('User Inputs_FPI_Calculator'!E3= \"FPI_SCC for v10\",1, \"\"))","v":""},{"$f":"'User Inputs_FPI_Calculator'!AF34","v":"Oil"},{"$f":"'User Inputs_FPI_Calculator'!AH34","v":0.89521292996080726}]
[null,null,null,null,{"$f":"'User Inputs_FPI_Calculator'!AF35","v":"Oil"},{"$f":"'User Inputs_FPI_Calculator'!AH35","v":0.89651472833991153}]
[null,null,null,null,{"$f":"'User Inputs_FPI_Calculator'!AF36","v":"Oil"},{"$f":"'User Inputs_FPI_Calculator'!AH36","v":0.8999237981239363}]
[null,null,null,null,{"$f":"'User Inputs_FPI_Calculator'!AF37","v":"Oil"},{"$f":"'User Inputs_FPI_Calculator'!AH37","v":0.90537020148663738}]
[null,null,null,null,{"$f":"'User Inputs_FPI_Calculator'!AF38","v":"Oil"},{"$f":"'User Inputs_FPI_Calculator'!AH38","v":0.91119118928362042}]
[null,null,null,null,{"$f":"'User Inputs_FPI_Calculator'!AF39","v":"Oil"},{"$f":"'User Inputs_FPI_Calculator'!AH39","v":0.91542689414764422}]
[null,null,null,null,{"$f":"'User Inputs_FPI_Calculator'!AF40","v":"Oil"},{"$f":"'User Inputs_FPI_Calculator'!AH40","v":0.92016740487084081}]
[null,null,null,null,{"$f":"'User Inputs_FPI_Calculator'!AF41","v":"Oil"},{"$f":"'User Inputs_FPI_Calculator'!AH41","v":0.92522202548435994}]
[null,null,null,null,{"$f":"'User Inputs_FPI_Calculator'!AF42","v":"Oil"},{"$f":"'User Inputs_FPI_Calculator'!AH42","v":0.92985968702895816}]
[null,null,null,null,{"$f":"'User Inputs_FPI_Calculator'!AF43","v":"Oil"},{"$f":"'User Inputs_FPI_Calculator'!AH43","v":0.93689255953688566}]
[null,null,null,null,{"$f":"'User Inputs_FPI_Calculator'!AF44","v":"Oil"},{"$f":"'User Inputs_FPI_Calculator'!AH44","v":0.93689255953688566}]
[null,null,null,null,{"$f":"'User Inputs_FPI_Calculator'!AF45","v":"Oil"},{"$f":"'User Inputs_FPI_Calculator'!AH45","v":0.94604834920142544}]
[null,null,null,null,{"$f":"'User Inputs_FPI_Calculator'!AF46","v":"Oil"},{"$f":"'User Inputs_FPI_Calculator'!AH46","v":0.95049477592143383}]
[null,null,null,null,{"$f":"'User Inputs_FPI_Calculator'!AF47","v":"Oil"},{"$f":"'User Inputs_FPI_Calculator'!AH47","v":0.95674782498027733}]
[null,null,null,null,{"$f":"'User Inputs_FPI_Calculator'!AF48","v":"Oil"},{"$f":"'User Inputs_FPI_Calculator'!AH48","v":0.9605850086171358}]
[null,null,null,null,{"$f":"'User Inputs_FPI_Calculator'!AF49","v":"Oil"},{"$f":"'User Inputs_FPI_Calculator'!AH49","v":0.96556782188143453}]
[null,null,null,null,{"$f":"'User Inputs_FPI_Calculator'!AF50","v":"Oil"},{"$f":"'User Inputs_FPI_Calculator'!AH50","v":0.96994747660376335}]
[null,null,null,null,{"$f":"'User Inputs_FPI_Calculator'!AF51","v":"Oil"},{"$f":"'User Inputs_FPI_Calculator'!AH51","v":0.97396696070359146}]
[null,null,null,null,{"$f":"'User Inputs_FPI_Calculator'!AF52","v":"Oil"},{"$f":"'User Inputs_FPI_Calculator'!AH52","v":0.98405895900413387}]
[null,null,null,null,{"$f":"'User Inputs_FPI_Calculator'!AF53","v":"Oil"},{"$f":"'User Inputs_FPI_Calculator'!AH53","v":6.4221432294747105}]
[null,null,null,null,{"$f":"'User Inputs_FPI_Calculator'!AF54","v":"Oil"},{"$f":"'User Inputs_FPI_Calculator'!AH54","v":-4.6030917570904002}]
[null,null,null,{"$f":"IF('User Inputs_FPI_Calculator'!E3= \"FPI for v8.9 (adjusted for 30 yr UPV)\", 3, IF('User Inputs_FPI_Calculator'!E3= \"FPI_SCC for v8.9 (adjusted for 30 year UPV)\",3, \"\"))","v":3},{"$f":"'User Inputs_FPI_Calculator'!AF55","v":"Electricity"},{"$f":"'User Inputs_FPI_Calculator'!AH55","v":1}]
[null,null,null,null,{"$f":"'User Inputs_FPI_Calculator'!AF56","v":"Electricity"},{"$f":"'User Inputs_FPI_Calculator'!AH56","v":0.94013512917764552}]
[null,null,null,null,{"$f":"'User Inputs_FPI_Calculator'!AF57","v":"Electricity"},{"$f":"'User Inputs_FPI_Calculator'!AH57","v":0.87158944043772812}]
[null,null,null,null,{"$f":"'User Inputs_FPI_Calculator'!AF58","v":"Electricity"},{"$f":"'User Inputs_FPI_Calculator'!AH58","v":0.84946776211430075}]
[null,null,null,null,{"$f":"'User Inputs_FPI_Calculator'!AF59","v":"Electricity"},{"$f":"'User Inputs_FPI_Calculator'!AH59","v":0.84512530839842193}]
[null,null,null,null,{"$f":"'User Inputs_FPI_Calculator'!AF60","v":"Electricity"},{"$f":"'User Inputs_FPI_Calculator'!AH60","v":0.84564516947866752}]
[null,null,null,null,{"$f":"'User Inputs_FPI_Calculator'!AF61","v":"Electricity"},{"$f":"'User Inputs_FPI_Calculator'!AH61","v":0.84726671797188313}]
[null,null,null,null,{"$f":"'User Inputs_FPI_Calculator'!AF62","v":"Electricity"},{"$f":"'User Inputs_FPI_Calculator'!AH62","v":0.85075500740042775}]
[null,null,null,null,{"$f":"'User Inputs_FPI_Calculator'!AF63","v":"Electricity"},{"$f":"'User Inputs_FPI_Calculator'!AH63","v":0.85789638148666936}]
[null,null,null,null,{"$f":"'User Inputs_FPI_Calculator'!AF64","v":"Electricity"},{"$f":"'User Inputs_FPI_Calculator'!AH64","v":0.86733719205736348}]
[null,null,null,{"$f":"IF('User Inputs_FPI_Calculator'!E3= \"FPI for v10\", 4, IF('User Inputs_FPI_Calculator'!E3= \"FPI_SCC for v10\",4, \"\"))","v":""},{"$f":"'User Inputs_FPI_Calculator'!AF65","v":"Electricity"},{"$f":"'User Inputs_FPI_Calculator'!AH65","v":0.87725271643111047}]
[null,null,null,null,{"$f":"'User Inputs_FPI_Calculator'!AF66","v":"Electricity"},{"$f":"'User Inputs_FPI_Calculator'!AH66","v":0.88814230433942498}]
[null,null,null,null,{"$f":"'User Inputs_FPI_Calculator'!AF67","v":"Electricity"},{"$f":"'User Inputs_FPI_Calculator'!AH67","v":0.89397286574054513}]
[null,null,null,null,{"$f":"'User Inputs_FPI_Calculator'!AF68","v":"Electricity"},{"$f":"'User Inputs_FPI_Calculator'!AH68","v":0.89948570213169665}]
[null,null,null,null,{"$f":"'User Inputs_FPI_Calculator'!AF69","v":"Electricity"},{"$f":"'User Inputs_FPI_Calculator'!AH69","v":0.90772953783683652}]
[null,null,null,null,{"$f":"'User Inputs_FPI_Calculator'!AF70","v":"Electricity"},{"$f":"'User Inputs_FPI_Calculator'!AH70","v":0.91821658550496765}]
[null,null,null,null,{"$f":"'User Inputs_FPI_Calculator'!AF71","v":"Electricity"},{"$f":"'User Inputs_FPI_Calculator'!AH71","v":0.92745230338578988}]
[null,null,null,null,{"$f":"'User Inputs_FPI_Calculator'!AF72","v":"Electricity"},{"$f":"'User Inputs_FPI_Calculator'!AH72","v":0.9357518810019565}]
[null,null,null,null,{"$f":"'User Inputs_FPI_Calculator'!AF73","v":"Electricity"},{"$f":"'User Inputs_FPI_Calculator'!AH73","v":0.9438556273710208}]
[null,null,null,null,{"$f":"'User Inputs_FPI_Calculator'!AF74","v":"Electricity"},{"$f":"'User Inputs_FPI_Calculator'!AH74","v":0.9520221789169242}]
[null,null,null,null,{"$f":"'User Inputs_FPI_Calculator'!AF75","v":"Electricity"},{"$f":"'User Inputs_FPI_Calculator'!AH75","v":0.95929276124420948}]
[null,null,null,null,{"$f":"'User Inputs_FPI_Calculator'!AF76","v":"Electricity"},{"$f":"'User Inputs_FPI_Calculator'!AH76","v":0.96886906159701491}]
[null,null,null,null,{"$f":"'User Inputs_FPI_Calculator'!AF77","v":"Electricity"},{"$f":"'User Inputs_FPI_Calculator'!AH77","v":0.97698611740366148}]
[null,null,null,null,{"$f":"'User Inputs_FPI_Calculator'!AF78","v":"Electricity"},{"$f":"'User Inputs_FPI_Calculator'!AH78","v":0.9842581552238463}]
[null,null,null,null,{"$f":"'User Inputs_FPI_Calculator'!AF79","v":"Electricity"},{"$f":"'User Inputs_FPI_Calculator'!AH79","v":6.4002935504658378}]
[null,null,null,null,{"$f":"'User Inputs_FPI_Calculator'!AF80","v":"Electricity"},{"$f":"'User Inputs_FPI_Calculator'!AH80","v":-4.5818544727261985}]
[null,null,null,{"$f":"IF('User Inputs_FPI_Calculator'!E3= \"FPI for v8.9 (adjusted for 30 yr UPV)\", 4, IF('User Inputs_FPI_Calculator'!E3= \"FPI_SCC for v8.9 (adjusted for 30 year UPV)\",4, \"\"))","v":4},{"$f":"'User Inputs_FPI_Calculator'!AF81","v":"Propane"},{"$f":"'User Inputs_FPI_Calculator'!AH81","v":1}]
[null,null,null,null,{"$f":"'User Inputs_FPI_Calculator'!AF82","v":"Propane"},{"$f":"'User Inputs_FPI_Calculator'!AH82","v":1.0225543509037718}]
[null,null,null,null,{"$f":"'User Inputs_FPI_Calculator'!AF83","v":"Propane"},{"$f":"'User Inputs_FPI_Calculator'!AH83","v":1.0029107349278659}]
[null,null,null,null,{"$f":"'User Inputs_FPI_Calculator'!AF84","v":"Propane"},{"$f":"'User Inputs_FPI_Calculator'!AH84","v":0.97362856311983892}]
[null,null,null,null,{"$f":"'User Inputs_FPI_Calculator'!AF85","v":"Propane"},{"$f":"'User Inputs_FPI_Calculator'!AH85","v":0.94877516487096869}]
[null,null,null,null,{"$f":"'User Inputs_FPI_Calculator'!AF86","v":"Propane"},{"$f":"'User Inputs_FPI_Calculator'!AH86","v":0.93573302800871294}]
[null,null,null,null,{"$f":"'User Inputs_FPI_Calculator'!AF87","v":"Propane"},{"$f":"'User Inputs_FPI_Calculator'!AH87","v":0.93001632971141923}]
[null,null,null,null,{"$f":"'User Inputs_FPI_Calculator'!AF88","v":"Propane"},{"$f":"'User Inputs_FPI_Calculator'!AH88","v":0.93256961321707676}]
[null,null,null,null,{"$f":"'User Inputs_FPI_Calculator'!AF89","v":"Propane"},{"$f":"'User Inputs_FPI_Calculator'!AH89","v":0.9413873687011719}]
[null,null,null,null,{"$f":"'User Inputs_FPI_Calculator'!AF90","v":"Propane"},{"$f":"'User Inputs_FPI_Calculator'!AH90","v":0.95536981217833505}]
[null,null,null,null,{"$f":"'User Inputs_FPI_Calculator'!AF91","v":"Propane"},{"$f":"'User Inputs_FPI_Calculator'!AH91","v":0.97329518985739738}]
[null,null,null,null,{"$f":"'User Inputs_FPI_Calculator'!AF92","v":"Propane"},{"$f":"'User Inputs_FPI_Calculator'!AH92","v":0.99213448889661426}]
[null,null,null,null,{"$f":"'User Inputs_FPI_Calculator'!AF93","v":"Propane"},{"$f":"'User Inputs_FPI_Calculator'!AH93","v":1.0084799338451442}]
[null,null,null,null,{"$f":"'User Inputs_FPI_Calculator'!AF94","v":"Propane"},{"$f":"'User Inputs_FPI_Calculator'!AH94","v":1.0214584162516123}]
[null,null,null,null,{"$f":"'User Inputs_FPI_Calculator'!AF95","v":"Propane"},{"$f":"'User Inputs_FPI_Calculator'!AH95","v":1.0349131728630421}]
[null,null,null,{"$f":"IF('User Inputs_FPI_Calculator'!E3= \"FPI for v10\", 2, IF('User Inputs_FPI_Calculator'!E3= \"FPI_SCC for v10\",2, \"\"))","v":""},{"$f":"'User Inputs_FPI_Calculator'!AF96","v":"Propane"},{"$f":"'User Inputs_FPI_Calculator'!AH96","v":1.0479082539146745}]
[null,null,null,null,{"$f":"'User Inputs_FPI_Calculator'!AF97","v":"Propane"},{"$f":"'User Inputs_FPI_Calculator'!AH97","v":1.0571079560195109}]
[null,null,null,null,{"$f":"'User Inputs_FPI_Calculator'!AF98","v":"Propane"},{"$f":"'User Inputs_FPI_Calculator'!AH98","v":1.067462819760947}]
[null,null,null,null,{"$f":"'User Inputs_FPI_Calculator'!AF99","v":"Propane"},{"$f":"'User Inputs_FPI_Calculator'!AH99","v":1.0785726032827161}]
[null,null,null,null,{"$f":"'User Inputs_FPI_Calculator'!AF100","v":"Propane"},{"$f":"'User Inputs_FPI_Calculator'!AH100","v":1.0876928978873526}]
[null,null,null,null,{"$f":"'User Inputs_FPI_Calculator'!AF101","v":"Propane"},{"$f":"'User Inputs_FPI_Calculator'!AH101","v":1.0938155410553203}]
[null,null,null,null,{"$f":"'User Inputs_FPI_Calculator'!AF102","v":"Propane"},{"$f":"'User Inputs_FPI_Calculator'!AH102","v":1.0994325757570367}]
[null,null,null,null,{"$f":"'User Inputs_FPI_Calculator'!AF103","v":"Propane"},{"$f":"'User Inputs_FPI_Calculator'!AH103","v":1.1041964866176772}]
[null,null,null,null,{"$f":"'User Inputs_FPI_Calculator'!AF104","v":"Propane"},{"$f":"'User Inputs_FPI_Calculator'!AH104","v":1.1307843479014483}]
[null,null,null,null,{"$f":"'User Inputs_FPI_Calculator'!AF105","v":"Propane"},{"$f":"'User Inputs_FPI_Calculator'!AH105","v":7.4123542413854793}]
[null,null,null,null,{"$f":"'User Inputs_FPI_Calculator'!AF106","v":"Propane"},{"$f":"'User Inputs_FPI_Calculator'!AH106","v":-5.313515908237024}]
[null,null,null,{"$f":"IF('User Inputs_FPI_Calculator'!E3= \"FPI for v8.9 (adjusted for 30 yr UPV)\", 5, IF('User Inputs_FPI_Calculator'!E3= \"FPI_SCC for v8.9 (adjusted for 30 year UPV)\",5, \"\"))","v":5},{"$f":"'User Inputs_FPI_Calculator'!AF107","v":"Wood"},{"$f":"'User Inputs_FPI_Calculator'!AH107","v":1}]
[null,null,null,null,{"$f":"'User Inputs_FPI_Calculator'!AF108","v":"Wood"},{"$f":"'User Inputs_FPI_Calculator'!AH108","v":1.0049806756849258}]
[null,null,null,null,{"$f":"'User Inputs_FPI_Calculator'!AF109","v":"Wood"},{"$f":"'User Inputs_FPI_Calculator'!AH109","v":1.0099613513698513}]
[null,null,null,null,{"$f":"'User Inputs_FPI_Calculator'!AF110","v":"Wood"},{"$f":"'User Inputs_FPI_Calculator'!AH110","v":1.0149420270547771}]
[null,null,null,null,{"$f":"'User Inputs_FPI_Calculator'!AF111","v":"Wood"},{"$f":"'User Inputs_FPI_Calculator'!AH111","v":1.0199227027397026}]
[null,null,null,null,{"$f":"'User Inputs_FPI_Calculator'!AF112","v":"Wood"},{"$f":"'User Inputs_FPI_Calculator'!AH112","v":1.0298840541095542}]
[null,null,null,null,{"$f":"'User Inputs_FPI_Calculator'!AF113","v":"Wood"},{"$f":"'User Inputs_FPI_Calculator'!AH113","v":1.03486472979448}]
[null,null,null,null,{"$f":"'User Inputs_FPI_Calculator'!AF114","v":"Wood"},{"$f":"'User Inputs_FPI_Calculator'!AH114","v":1.0398454054794057}]
[null,null,null,null,{"$f":"'User Inputs_FPI_Calculator'!AF115","v":"Wood"},{"$f":"'User Inputs_FPI_Calculator'!AH115","v":1.0448260811643313}]
[null,null,null,null,{"$f":"'User Inputs_FPI_Calculator'!AF116","v":"Wood"},{"$f":"'User Inputs_FPI_Calculator'!AH116","v":1.0498067568492571}]
[null,null,null,null,{"$f":"'User Inputs_FPI_Calculator'!AF117","v":"Wood"},{"$f":"'User Inputs_FPI_Calculator'!AH117","v":1.0547874325341828}]
[null,null,null,null,{"$f":"'User Inputs_FPI_Calculator'!AF118","v":"Wood"},{"$f":"'User Inputs_FPI_Calculator'!AH118","v":1.0597681082191086}]
[null,null,null,null,{"$f":"'User Inputs_FPI_Calculator'!AF119","v":"Wood"},{"$f":"'User Inputs_FPI_Calculator'!AH119","v":1.0647487839040344}]
[null,null,null,null,{"$f":"'User Inputs_FPI_Calculator'!AF120","v":"Wood"},{"$f":"'User Inputs_FPI_Calculator'!AH120","v":1.0697294595889599}]
[null,null,null,null,{"$f":"'User Inputs_FPI_Calculator'!AF121","v":"Wood"},{"$f":"'User Inputs_FPI_Calculator'!AH121","v":1.0796908109588113}]
[null,null,null,null,{"$f":"'User Inputs_FPI_Calculator'!AF122","v":"Wood"},{"$f":"'User Inputs_FPI_Calculator'!AH122","v":1.084671486643737}]
[null,null,null,null,{"$f":"'User Inputs_FPI_Calculator'!AF123","v":"Wood"},{"$f":"'User Inputs_FPI_Calculator'!AH123","v":1.0896521623286628}]
[null,null,null,null,{"$f":"'User Inputs_FPI_Calculator'!AF124","v":"Wood"},{"$f":"'User Inputs_FPI_Calculator'!AH124","v":1.0946328380135886}]
[null,null,null,null,{"$f":"'User Inputs_FPI_Calculator'!AF125","v":"Wood"},{"$f":"'User Inputs_FPI_Calculator'!AH125","v":1.0996135136985139}]
[null,null,null,null,{"$f":"'User Inputs_FPI_Calculator'!AF126","v":"Wood"},{"$f":"'User Inputs_FPI_Calculator'!AH126","v":1.1045941893834397}]
[null,null,null,{"$f":"IF('User Inputs_FPI_Calculator'!E3= \"FPI for v10\", 7, IF('User Inputs_FPI_Calculator'!E3= \"FPI_SCC for v10\",7, \"\"))","v":""},{"$f":"'User Inputs_FPI_Calculator'!AF127","v":"Wood"},{"$f":"'User Inputs_FPI_Calculator'!AH127","v":1.1095748650683654}]
[null,null,null,null,{"$f":"'User Inputs_FPI_Calculator'!AF128","v":"Wood"},{"$f":"'User Inputs_FPI_Calculator'!AH128","v":1.119536216438217}]
[null,null,null,null,{"$f":"'User Inputs_FPI_Calculator'!AF129","v":"Wood"},{"$f":"'User Inputs_FPI_Calculator'!AH129","v":1.1245168921231428}]
[null,null,null,null,{"$f":"'User Inputs_FPI_Calculator'!AF130","v":"Wood"},{"$f":"'User Inputs_FPI_Calculator'!AH130","v":1.1294975678080683}]
[null,null,null,null,{"$f":"'User Inputs_FPI_Calculator'!AF131","v":"Wood"},{"$f":"'User Inputs_FPI_Calculator'!AH131","v":7.3770856987033842}]
[null,null,null,null,{"$f":"'User Inputs_FPI_Calculator'!AF132","v":"Wood"},{"$f":"'User Inputs_FPI_Calculator'!AH132","v":-5.2904267596887777}]
[null,null,null,{"$f":"IF('User Inputs_FPI_Calculator'!E3= \"FPI for v8.9 (adjusted for 30 yr UPV)\", 6, IF('User Inputs_FPI_Calculator'!E3= \"FPI_SCC for v8.9 (adjusted for 30 year UPV)\",6, \"\"))","v":6},{"$f":"'User Inputs_FPI_Calculator'!AF133","v":"Coal"},{"$f":"'User Inputs_FPI_Calculator'!AH133","v":1}]
[null,null,null,null,{"$f":"'User Inputs_FPI_Calculator'!AF134","v":"Coal"},{"$f":"'User Inputs_FPI_Calculator'!AH134","v":0.99958037539727507}]
[null,null,null,null,{"$f":"'User Inputs_FPI_Calculator'!AF135","v":"Coal"},{"$f":"'User Inputs_FPI_Calculator'!AH135","v":1.0154324603239135}]
[null,null,null,null,{"$f":"'User Inputs_FPI_Calculator'!AF136","v":"Coal"},{"$f":"'User Inputs_FPI_Calculator'!AH136","v":1.0230917597032092}]
[null,null,null,null,{"$f":"'User Inputs_FPI_Calculator'!AF137","v":"Coal"},{"$f":"'User Inputs_FPI_Calculator'!AH137","v":1.0199693294193084}]
[null,null,null,null,{"$f":"'User Inputs_FPI_Calculator'!AF138","v":"Coal"},{"$f":"'User Inputs_FPI_Calculator'!AH138","v":1.0125766577111781}]
[null,null,null,null,{"$f":"'User Inputs_FPI_Calculator'!AF139","v":"Coal"},{"$f":"'User Inputs_FPI_Calculator'!AH139","v":1.0072756330471637}]
[null,null,null,null,{"$f":"'User Inputs_FPI_Calculator'!AF140","v":"Coal"},{"$f":"'User Inputs_FPI_Calculator'!AH140","v":1.0031508877058128}]
[null,null,null,null,{"$f":"'User Inputs_FPI_Calculator'!AF141","v":"Coal"},{"$f":"'User Inputs_FPI_Calculator'!AH141","v":0.998864722589065}]
[null,null,null,null,{"$f":"'User Inputs_FPI_Calculator'!AF142","v":"Coal"},{"$f":"'User Inputs_FPI_Calculator'!AH142","v":0.99395382073894578}]
[null,null,null,null,{"$f":"'User Inputs_FPI_Calculator'!AF143","v":"Coal"},{"$f":"'User Inputs_FPI_Calculator'!AH143","v":0.98999259627037806}]
[null,null,null,null,{"$f":"'User Inputs_FPI_Calculator'!AF144","v":"Coal"},{"$f":"'User Inputs_FPI_Calculator'!AH144","v":0.98754377488635114}]
[null,null,null,null,{"$f":"'User Inputs_FPI_Calculator'!AF145","v":"Coal"},{"$f":"'User Inputs_FPI_Calculator'!AH145","v":0.98550263565661234}]
[null,null,null,null,{"$f":"'User Inputs_FPI_Calculator'!AF146","v":"Coal"},{"$f":"'User Inputs_FPI_Calculator'!AH146","v":0.983826355068257}]
[null,null,null,null,{"$f":"'User Inputs_FPI_Calculator'!AF147","v":"Coal"},{"$f":"'User Inputs_FPI_Calculator'!AH147","v":0.98293976559455631}]
[null,null,null,null,{"$f":"'User Inputs_FPI_Calculator'!AF148","v":"Coal"},{"$f":"'User Inputs_FPI_Calculator'!AH148","v":0.98280573923407222}]
[null,null,null,null,{"$f":"'User Inputs_FPI_Calculator'!AF149","v":"Coal"},{"$f":"'User Inputs_FPI_Calculator'!AH149","v":0.98242345287969679}]
[null,null,null,null,{"$f":"'User Inputs_FPI_Calculator'!AF150","v":"Coal"},{"$f":"'User Inputs_FPI_Calculator'!AH150","v":0.98069830369882582}]
[null,null,null,null,{"$f":"'User Inputs_FPI_Calculator'!AF151","v":"Coal"},{"$f":"'User Inputs_FPI_Calculator'!AH151","v":0.97898990127258756}]
[null,null,null,null,{"$f":"'User Inputs_FPI_Calculator'!AF152","v":"Coal"},{"$f":"'User Inputs_FPI_Calculator'!AH152","v":0.97734247820694897}]
[null,null,null,null,{"$f":"'User Inputs_FPI_Calculator'!AF153","v":"Coal"},{"$f":"'User Inputs_FPI_Calculator'!AH153","v":0.97725979661604012}]
[null,null,null,null,{"$f":"'User Inputs_FPI_Calculator'!AF154","v":"Coal"},{"$f":"'User Inputs_FPI_Calculator'!AH154","v":0.97796753592336461}]
[null,null,null,null,{"$f":"'User Inputs_FPI_Calculator'!AF155","v":"Coal"},{"$f":"'User Inputs_FPI_Calculator'!AH155","v":0.97985988033346649}]
[null,null,null,null,{"$f":"'User Inputs_FPI_Calculator'!AF156","v":"Coal"},{"$f":"'User Inputs_FPI_Calculator'!AH156","v":0.9801098274443335}]
[null,null,null,null,{"$f":"'User Inputs_FPI_Calculator'!AF157","v":"Coal"},{"$f":"'User Inputs_FPI_Calculator'!AH157","v":6.2986048529765206}]
[null,null,null,{"$f":"IF('User Inputs_FPI_Calculator'!E3= \"FPI for v10\", 5, IF('User Inputs_FPI_Calculator'!E3= \"FPI_SCC for v10\",5, \"\"))","v":""},{"$f":"'User Inputs_FPI_Calculator'!AF158","v":"Coal"},{"$f":"'User Inputs_FPI_Calculator'!AH158","v":-4.4961003834566755}]
[null,null,null,{"$f":"IF('User Inputs_FPI_Calculator'!E3= \"FPI for v8.9 (adjusted for 30 yr UPV)\", 7, IF('User Inputs_FPI_Calculator'!E3= \"FPI_SCC for v8.9 (adjusted for 30 year UPV)\",7, \"\"))","v":7},{"$f":"'User Inputs_FPI_Calculator'!AF159","v":"Kerosene"},{"$f":"'User Inputs_FPI_Calculator'!AH159","v":1}]
[null,null,null,null,{"$f":"'User Inputs_FPI_Calculator'!AF160","v":"Kerosene"},{"$f":"'User Inputs_FPI_Calculator'!AH160","v":0.96771386467472953}]
[null,null,null,null,{"$f":"'User Inputs_FPI_Calculator'!AF161","v":"Kerosene"},{"$f":"'User Inputs_FPI_Calculator'!AH161","v":0.93019288448142434}]
[null,null,null,null,{"$f":"'User Inputs_FPI_Calculator'!AF162","v":"Kerosene"},{"$f":"'User Inputs_FPI_Calculator'!AH162","v":0.91230217041628336}]
[null,null,null,null,{"$f":"'User Inputs_FPI_Calculator'!AF163","v":"Kerosene"},{"$f":"'User Inputs_FPI_Calculator'!AH163","v":0.9024325042737259}]
[null,null,null,null,{"$f":"'User Inputs_FPI_Calculator'!AF164","v":"Kerosene"},{"$f":"'User Inputs_FPI_Calculator'!AH164","v":0.89636970823202466}]
[null,null,null,null,{"$f":"'User Inputs_FPI_Calculator'!AF165","v":"Kerosene"},{"$f":"'User Inputs_FPI_Calculator'!AH165","v":0.8977647204404382}]
[null,null,null,null,{"$f":"'User Inputs_FPI_Calculator'!AF166","v":"Kerosene"},{"$f":"'User Inputs_FPI_Calculator'!AH166","v":0.90125582191632325}]
[null,null,null,null,{"$f":"'User Inputs_FPI_Calculator'!AF167","v":"Kerosene"},{"$f":"'User Inputs_FPI_Calculator'!AH167","v":0.90677344595524934}]
[null,null,null,null,{"$f":"'User Inputs_FPI_Calculator'!AF168","v":"Kerosene"},{"$f":"'User Inputs_FPI_Calculator'!AH168","v":0.91266366671362364}]
[null,null,null,null,{"$f":"'User Inputs_FPI_Calculator'!AF169","v":"Kerosene"},{"$f":"'User Inputs_FPI_Calculator'!AH169","v":0.91697701676900156}]
[null,null,null,null,{"$f":"'User Inputs_FPI_Calculator'!AF170","v":"Kerosene"},{"$f":"'User Inputs_FPI_Calculator'!AH170","v":0.92179249395479912}]
[null,null,null,null,{"$f":"'User Inputs_FPI_Calculator'!AF171","v":"Kerosene"},{"$f":"'User Inputs_FPI_Calculator'!AH171","v":0.92692041422143312}]
[null,null,null,null,{"$f":"'User Inputs_FPI_Calculator'!AF172","v":"Kerosene"},{"$f":"'User Inputs_FPI_Calculator'!AH172","v":0.931633587993003}]
[null,null,null,null,{"$f":"'User Inputs_FPI_Calculator'!AF173","v":"Kerosene"},{"$f":"'User Inputs_FPI_Calculator'!AH173","v":0.93882938441431851}]
[null,null,null,null,{"$f":"'User Inputs_FPI_Calculator'!AF174","v":"Kerosene"},{"$f":"'User Inputs_FPI_Calculator'!AH174","v":0.94377250730470608}]
[null,null,null,null,{"$f":"'User Inputs_FPI_Calculator'!AF175","v":"Kerosene"},{"$f":"'User Inputs_FPI_Calculator'!AH175","v":0.94813683283134542}]
[null,null,null,null,{"$f":"'User Inputs_FPI_Calculator'!AF176","v":"Kerosene"},{"$f":"'User Inputs_FPI_Calculator'!AH176","v":0.95265978655700501}]
[null,null,null,null,{"$f":"'User Inputs_FPI_Calculator'!AF177","v":"Kerosene"},{"$f":"'User Inputs_FPI_Calculator'!AH177","v":0.95897977586430039}]
[null,null,null,null,{"$f":"'User Inputs_FPI_Calculator'!AF178","v":"Kerosene"},{"$f":"'User Inputs_FPI_Calculator'!AH178","v":0.96289671942682198}]
[null,null,null,null,{"$f":"'User Inputs_FPI_Calculator'!AF179","v":"Kerosene"},{"$f":"'User Inputs_FPI_Calculator'!AH179","v":0.96795321338658591}]
[null,null,null,null,{"$f":"'User Inputs_FPI_Calculator'!AF180","v":"Kerosene"},{"$f":"'User Inputs_FPI_Calculator'!AH180","v":0.97250987119876353}]
[null,null,null,null,{"$f":"'User Inputs_FPI_Calculator'!AF181","v":"Kerosene"},{"$f":"'User Inputs_FPI_Calculator'!AH181","v":0.97660814785534833}]
[null,null,null,null,{"$f":"'User Inputs_FPI_Calculator'!AF182","v":"Kerosene"},{"$f":"'User Inputs_FPI_Calculator'!AH182","v":0.98674671519920054}]
[null,null,null,null,{"$f":"'User Inputs_FPI_Calculator'!AF183","v":"Kerosene"},{"$f":"'User Inputs_FPI_Calculator'!AH183","v":6.4414127895891449}]
[null,null,null,null,{"$f":"'User Inputs_FPI_Calculator'!AF184","v":"Kerosene"},{"$f":"'User Inputs_FPI_Calculator'!AH184","v":-4.6172545840696948}]
[null,null,null,{"$f":"IF('User Inputs_FPI_Calculator'!E3= \"FPI for v8.9 (adjusted for 30 yr UPV)\", 8, IF('User Inputs_FPI_Calculator'!E3= \"FPI_SCC for v8.9 (adjusted for 30 year UPV)\",8, \"\"))","v":8},{"$f":"'User Inputs_FPI_Calculator'!AF185","v":"Other"},{"$f":"'User Inputs_FPI_Calculator'!AH185","v":1}]
[null,null,null,null,{"$f":"'User Inputs_FPI_Calculator'!AF186","v":"Other"},{"$f":"'User Inputs_FPI_Calculator'!AH186","v":1}]
[null,null,null,null,{"$f":"'User Inputs_FPI_Calculator'!AF187","v":"Other"},{"$f":"'User Inputs_FPI_Calculator'!AH187","v":1}]
[null,null,null,null,{"$f":"'User Inputs_FPI_Calculator'!AF188","v":"Other"},{"$f":"'User Inputs_FPI_Calculator'!AH188","v":1}]
[null,null,null,{"$f":"IF('User Inputs_FPI_Calculator'!E3= \"FPI for v10\", 6, IF('User Inputs_FPI_Calculator'!E3= \"FPI_SCC for v10\",6, \"\"))","v":""},{"$f":"'User Inputs_FPI_Calculator'!AF189","v":"Other"},{"$f":"'User Inputs_FPI_Calculator'!AH189","v":1}]
[null,null,null,null,{"$f":"'User Inputs_FPI_Calculator'!AF190","v":"Other"},{"$f":"'User Inputs_FPI_Calculator'!AH190","v":1}]
[null,null,null,null,{"$f":"'User Inputs_FPI_Calculator'!AF191","v":"Other"},{"$f":"'User Inputs_FPI_Calculator'!AH191","v":1}]
[null,null,null,null,{"$f":"'User Inputs_FPI_Calculator'!AF192","v":"Other"},{"$f":"'User Inputs_FPI_Calculator'!AH192","v":1}]
[null,null,null,null,{"$f":"'User Inputs_FPI_Calculator'!AF193","v":"Other"},{"$f":"'User Inputs_FPI_Calculator'!AH193","v":1}]
[null,null,null,null,{"$f":"'User Inputs_FPI_Calculator'!AF194","v":"Other"},{"$f":"'User Inputs_FPI_Calculator'!AH194","v":1}]
[null,null,null,null,{"$f":"'User Inputs_FPI_Calculator'!AF195","v":"Other"},{"$f":"'User Inputs_FPI_Calculator'!AH195","v":1}]
[null,null,null,null,{"$f":"'User Inputs_FPI_Calculator'!AF196","v":"Other"},{"$f":"'User Inputs_FPI_Calculator'!AH196","v":1}]
[null,null,null,null,{"$f":"'User Inputs_FPI_Calculator'!AF197","v":"Other"},{"$f":"'User Inputs_FPI_Calculator'!AH197","v":1}]
[null,null,null,null,{"$f":"'User Inputs_FPI_Calculator'!AF198","v":"Other"},{"$f":"'User Inputs_FPI_Calculator'!AH198","v":1}]
[null,null,null,null,{"$f":"'User Inputs_FPI_Calculator'!AF199","v":"Other"},{"$f":"'User Inputs_FPI_Calculator'!AH199","v":1}]
[null,null,null,null,{"$f":"'User Inputs_FPI_Calculator'!AF200","v":"Other"},{"$f":"'User Inputs_FPI_Calculator'!AH200","v":1}]
[null,null,null,null,{"$f":"'User Inputs_FPI_Calculator'!AF201","v":"Other"},{"$f":"'User Inputs_FPI_Calculator'!AH201","v":1}]
[null,null,null,null,{"$f":"'User Inputs_FPI_Calculator'!AF202","v":"Other"},{"$f":"'User Inputs_FPI_Calculator'!AH202","v":1}]
[null,null,null,null,{"$f":"'User Inputs_FPI_Calculator'!AF203","v":"Other"},{"$f":"'User Inputs_FPI_Calculator'!AH203","v":1}]
[null,null,null,null,{"$f":"'User Inputs_FPI_Calculator'!AF204","v":"Other"},{"$f":"'User Inputs_FPI_Calculator'!AH204","v":1}]
[null,null,null,null,{"$f":"'User Inputs_FPI_Calculator'!AF205","v":"Other"},{"$f":"'User Inputs_FPI_Calculator'!AH205","v":1}]
[null,null,null,null,{"$f":"'User Inputs_FPI_Calculator'!AF206","v":"Other"},{"$f":"'User Inputs_FPI_Calculator'!AH206","v":1}]
[null,null,null,null,{"$f":"'User Inputs_FPI_Calculator'!AF207","v":"Other"},{"$f":"'User Inputs_FPI_Calculator'!AH207","v":1}]
[null,null,null,null,{"$f":"'User Inputs_FPI_Calculator'!AF208","v":"Other"},{"$f":"'User Inputs_FPI_Calculator'!AH208","v":1}]
[null,null,null,null,{"$f":"'User Inputs_FPI_Calculator'!AF209","v":"Other"},{"$f":"'User Inputs_FPI_Calculator'!AH209","v":6.4171914438781892}]
[null,null,null,null,{"$f":"'User Inputs_FPI_Calculator'!AF210","v":"Other"},{"$f":"'User Inputs_FPI_Calculator'!AH210","v":-4.5797071871945407}]
[null,null,null,null,{"$f":"'User Inputs_FPI_Calculator'!AF211","v":"  "},{"$f":"'User Inputs_FPI_Calculator'!AH211","v":"  "}]
[null,null,null,null,{"$f":"'User Inputs_FPI_Calculator'!AF212","v":"  "},{"$f":"'User Inputs_FPI_Calculator'!AH212","v":"  "}]
[null,null,null,null,{"$f":"'User Inputs_FPI_Calculator'!AF213","v":"  "},{"$f":"'User Inputs_FPI_Calculator'!AH213","v":"  "}]
[null,null,null,null,{"$f":"'User Inputs_FPI_Calculator'!AF214","v":"  "},{"$f":"'User Inputs_FPI_Calculator'!AH214","v":"  "}]
[null,null,null,null,{"$f":"'User Inputs_FPI_Calculator'!AF215","v":"  "},{"$f":"'User Inputs_FPI_Calculator'!AH215","v":"  "}]
[null,null,null,null,{"$f":"'User Inputs_FPI_Calculator'!AF216","v":"  "},{"$f":"'User Inputs_FPI_Calculator'!AH216","v":"  "}]
[null,null,null,null,{"$f":"'User Inputs_FPI_Calculator'!AF217","v":"  "},{"$f":"'User Inputs_FPI_Calculator'!AH217","v":"  "}]
[null,null,null,null,{"$f":"'User Inputs_FPI_Calculator'!AF218","v":"  "},{"$f":"'User Inputs_FPI_Calculator'!AH218","v":"  "}]
[null,null,null,null,{"$f":"'User Inputs_FPI_Calculator'!AF219","v":"  "},{"$f":"'User Inputs_FPI_Calculator'!AH219","v":"  "}]
[null,null,null,{"$f":"IF('User Inputs_FPI_Calculator'!E3= \"FPI for v10\", 8, IF('User Inputs_FPI_Calculator'!E3= \"FPI_SCC for v10\",8, \"\"))","v":""},{"$f":"'User Inputs_FPI_Calculator'!AF220","v":"  "},{"$f":"'User Inputs_FPI_Calculator'!AH220","v":"  "}]
[null,null,null,null,{"$f":"'User Inputs_FPI_Calculator'!AF221","v":"  "},{"$f":"'User Inputs_FPI_Calculator'!AH221","v":"  "}]
[null,null,null,null,{"$f":"'User Inputs_FPI_Calculator'!AF222","v":"  "},{"$f":"'User Inputs_FPI_Calculator'!AH222","v":"  "}]
[null,null,null,null,{"$f":"'User Inputs_FPI_Calculator'!AF223","v":"  "},{"$f":"'User Inputs_FPI_Calculator'!AH223","v":"  "}]
[null,null,null,null,{"$f":"'User Inputs_FPI_Calculator'!AF224","v":"  "},{"$f":"'User Inputs_FPI_Calculator'!AH224","v":"  "}]
[null,null,null,null,{"$f":"'User Inputs_FPI_Calculator'!AF225","v":"  "},{"$f":"'User Inputs_FPI_Calculator'!AH225","v":"  "}]
[null,null,null,null,{"$f":"'User Inputs_FPI_Calculator'!AF226","v":"  "},{"$f":"'User Inputs_FPI_Calculator'!AH226","v":"  "}]
[null,null,null,null,{"$f":"'User Inputs_FPI_Calculator'!AF227","v":"  "},{"$f":"'User Inputs_FPI_Calculator'!AH227","v":"  "}]
[null,null,null,null,{"$f":"'User Inputs_FPI_Calculator'!AF228","v":"  "},{"$f":"'User Inputs_FPI_Calculator'!AH228","v":"  "}]
[null,null,null,null,{"$f":"'User Inputs_FPI_Calculator'!AF229","v":"  "},{"$f":"'User Inputs_FPI_Calculator'!AH229","v":"  "}]
[null,null,null,null,{"$f":"'User Inputs_FPI_Calculator'!AF230","v":"  "},{"$f":"'User Inputs_FPI_Calculator'!AH230","v":"  "}]
[null,null,null,null,{"$f":"'User Inputs_FPI_Calculator'!AF231","v":"  "},{"$f":"'User Inputs_FPI_Calculator'!AH231","v":"  "}]
[null,null,null,null,{"$f":"'User Inputs_FPI_Calculator'!AF232","v":"  "},{"$f":"'User Inputs_FPI_Calculator'!AH232","v":"  "}]
[null,null,null,null,{"$f":"'User Inputs_FPI_Calculator'!AF233","v":"  "},{"$f":"'User Inputs_FPI_Calculator'!AH233","v":"  "}]
[null,null,null,null,{"$f":"'User Inputs_FPI_Calculator'!AF234","v":"  "},{"$f":"'User Inputs_FPI_Calculator'!AH234","v":"  "}]
[null,null,null,null,{"$f":"'User Inputs_FPI_Calculator'!AF235","v":"  "},{"$f":"'User Inputs_FPI_Calculator'!AH235","v":"  "}]
[null,null,null,null,{"$f":"'User Inputs_FPI_Calculator'!AF236","v":"  "},{"$f":"'User Inputs_FPI_Calculator'!AH236","v":"  "}]
[null,null,null,null,{"$f":"'User Inputs_FPI_Calculator'!AF237","v":"  "},{"$f":"'User Inputs_FPI_Calculator'!AH237","v":"  "}]
[null,null,null,null,{"$f":"'User Inputs_FPI_Calculator'!AF238","v":"  "},{"$f":"'User Inputs_FPI_Calculator'!AH238","v":"  "}]
[null,null,null,null,{"$f":"'User Inputs_FPI_Calculator'!AF239","v":"  "},{"$f":"'User Inputs_FPI_Calculator'!AH239","v":"  "}]
[null,null,null,null,{"$f":"'User Inputs_FPI_Calculator'!AF240","v":"  "},{"$f":"'User Inputs_FPI_Calculator'!AH240","v":"  "}]
[null,null,null,null,{"$f":"'User Inputs_FPI_Calculator'!AF241","v":"  "},{"$f":"'User Inputs_FPI_Calculator'!AH241","v":"  "}]
[null,null,null,null,{"$f":"'User Inputs_FPI_Calculator'!AF242","v":"  "},{"$f":"'User Inputs_FPI_Calculator'!AH242","v":"  "}]
[null,null,null,null,{"$f":"'User Inputs_FPI_Calculator'!AF243","v":"  "},{"$f":"'User Inputs_FPI_Calculator'!AH243","v":"  "}]
[null,null,null,null,{"$f":"'User Inputs_FPI_Calculator'!AF244","v":"  "},{"$f":"'User Inputs_FPI_Calculator'!AH244","v":"  "}]
[null,null,null,null,{"$f":"'User Inputs_FPI_Calculator'!AF245","v":"  "},{"$f":"'User Inputs_FPI_Calculator'!AH245","v":"  "}]
[null,null,null,null,{"$f":"'User Inputs_FPI_Calculator'!AF246","v":"  "},{"$f":"'User Inputs_FPI_Calculator'!AH246","v":"  "}]
[null,null,null,null,{"$f":"'User Inputs_FPI_Calculator'!AF247","v":"  "},{"$f":"'User Inputs_FPI_Calculator'!AH247","v":"  "}]
[null,null,null,null,{"$f":"'User Inputs_FPI_Calculator'!AF248","v":"  "},{"$f":"'User Inputs_FPI_Calculator'!AH248","v":"  "}]
[null,null,null,null,{"$f":"'User Inputs_FPI_Calculator'!AF249","v":"  "},{"$f":"'User Inputs_FPI_Calculator'!AH249","v":"  "}]
[null,null,null,null,{"$f":"'User Inputs_FPI_Calculator'!AF250","v":"  "},{"$f":"'User Inputs_FPI_Calculator'!AH250","v":"  "}]

{"sheet":"References","index":8,"n_rows":22,"n_cols":5,"rows_kept":22,"cut":false,"hidden":true,"merged":[[20,3,21,3]]}
[]
[]
[]
[]
[null,null,null,"References:","1) The projected real FPIs are obtained from Table Ca-1 through Table Ca-5 in the data tables available at https://data.nist.gov/od/id/mds2-3069"]
[]
[null,null,null,null,"2) The formula for UPV is used from 2023 Annual Supplement to NIST Handbook 135 (NISTIR 85-3273-38) page no.7 available at https://tsapps.nist.gov/publication/get_pdf.cfm?pub_id=956573"]
[]
[null,null,null,null,"3) Fuel Price Modifier (2020$/fuel unit) available at https://www.energy.gov/sites/default/files/2022-10/WPN-22-10-Revised-NEI_0.pdf"]
[]
[null,null,null,null,"4) Guidelines on NEI- https://www.energy.gov/scep/wap/wpn-22-10-including-non-energy-impacts-within-wap-text-version"]
[]
[]
[]
[null,null,null,"Wood-","The $100.42/cord fuel cost modifier comes from 53 ($/MTCO2) * 0.001 (MTCO2/kgCO2) * 93.8 (kgCO2/MMBtu) * 20.2 (MMBtu/cord) = $100.42/cord"]
[null,null,null,null,"o   93.8 kgCO2/MMBtu is from EPA"]
[null,null,null,null,"o   $53/metric ton is from WPN 22-10"]
[null,null,null,null,"o   20.2 MMBtu/cord is from User Input tab"]
[]
[]
[null,null,null,"For wood fuel cost modifier","https://gcc02.safelinks.protection.outlook.com/?url=https%3A%2F%2Fwww.ecfr.gov%2Fcurrent%2Ftitle-40%2Fchapter-I%2Fsubchapter-C%2Fpart-98%2Fsubpart-C&data=05%7C01%7Cghodeswara%40ornl.gov%7C2475b72f105d481471d008dbb099cfa1%7Cdb3dbd434c4b45449f8a0553f9f5f25e%7C1%7C0%7C638297946889526821%7CUnknown%7CTWFpbGZsb3d8eyJWIjoiMC4wLjAwMDAiLCJQIjoiV2luMzIiLCJBTiI6Ik1haWwiLCJXVCI6Mn0%3D%7C3000%7C%7C%7C&sdata=o2vBnX5h9rBATZvBNkJIB4vrILMQH4%2FSDZU5D2MwSGY%3D&reserved=0"]
[null,null,null,null,"https://www.epa.gov/climateleadership/ghg-emission-factors-hub "]

{"sheet":"Results (2)","index":9,"n_rows":250,"n_cols":5,"rows_kept":250,"cut":false,"hidden":true,"merged":[[0,2,0,4]]}
["baseyear","censusregion","fuel_escalation_rates"]
[2022,{"$f":"IF('User Inputs_FPI_Calculator'!I5=\"Region 1 - Northeast\", 1, IF('User Inputs_FPI_Calculator'!I5=\"Region 2 - Midwest\", 2, IF('User Inputs_FPI_Calculator'!I5=\"Region 3 - South\", 3, IF('User Inputs_FPI_Calculator'!I5=\"Region 4 - West\", 4, IF('User Inputs_FPI_Calculator'!I5=\"Region 5 - US\", 5, \"\")))))","v":4},"fuel_type_id","fuel_name","rate"]
[null,null,{"$f":"IF('User Inputs_FPI_Calculator'!E3 = \"FPI for v8.9 (adjusted for 30 yr UPV)\", 1, IF('User Inputs_FPI_Calculator'!E3 =  \"FPI_SCC for v8.9 (adjusted for 30 year UPV)\", 1, IF('User Inputs_FPI_Calculator'!E3 = \"FPI for v10\", 3, IF('User Inputs_FPI_Calculator'!E3 = \"FPI_SCC for v10\", 3, \"\"))))","v":1},{"$f":"'User Inputs_FPI_Calculator'!AF3","v":"Natural Gas"},{"$f":"'User Inputs_FPI_Calculator'!AH3","v":1}]
[null,null,null,{"$f":"'User Inputs_FPI_Calculator'!AF4","v":"Natural Gas"},{"$f":"'User Inputs_FPI_Calculator'!AH4","v":0.98644692290046421}]
[null,null,null,{"$f":"'User Inputs_FPI_Calculator'!AF5","v":"Natural Gas"},{"$f":"'User Inputs_FPI_Calculator'!AH5","v":0.93139274010388873}]
[null,null,null,{"$f":"'User Inputs_FPI_Calculator'!AF6","v":"Natural Gas"},{"$f":"'User Inputs_FPI_Calculator'!AH6","v":0.87012329782988573}]
[null,null,null,{"$f":"'User Inputs_FPI_Calculator'!AF7","v":"Natural Gas"},{"$f":"'User Inputs_FPI_Calculator'!AH7","v":0.81951711053496357}]
[null,null,null,{"$f":"'User Inputs_FPI_Calculator'!AF8","v":"Natural Gas"},{"$f":"'User Inputs_FPI_Calculator'!AH8","v":0.7808202045643523}]
[null,null,null,{"$f":"'User Inputs_FPI_Calculator'!AF9","v":"Natural Gas"},{"$f":"'User Inputs_FPI_Calculator'!AH9","v":0.77264524240858889}]
[null,null,null,{"$f":"'User Inputs_FPI_Calculator'!AF10","v":"Natural Gas"},{"$f":"'User Inputs_FPI_Calculator'!AH10","v":0.77671981530962486}]
[null,null,null,{"$f":"'User Inputs_FPI_Calculator'!AF11","v":"Natural Gas"},{"$f":"'User Inputs_FPI_Calculator'!AH11","v":0.78415816838761399}]
[null,null,null,{"$f":"'User Inputs_FPI_Calculator'!AF12","v":"Natural Gas"},{"$f":"'User Inputs_FPI_Calculator'!AH12","v":0.79201650970829895}]
[null,null,null,{"$f":"'User Inputs_FPI_Calculator'!AF13","v":"Natural Gas"},{"$f":"'User Inputs_FPI_Calculator'!AH13","v":0.80241362423890805}]
[null,null,null,{"$f":"'User Inputs_FPI_Calculator'!AF14","v":"Natural Gas"},{"$f":"'User Inputs_FPI_Calculator'!AH14","v":0.81358988591630232}]
[null,null,null,{"$f":"'User Inputs_FPI_Calculator'!AF15","v":"Natural Gas"},{"$f":"'User Inputs_FPI_Calculator'!AH15","v":0.82402253842054884}]
[null,null,null,{"$f":"'User Inputs_FPI_Calculator'!AF16","v":"Natural Gas"},{"$f":"'User Inputs_FPI_Calculator'!AH16","v":0.83055121890129313}]
[null,null,null,{"$f":"'User Inputs_FPI_Calculator'!AF17","v":"Natural Gas"},{"$f":"'User Inputs_FPI_Calculator'!AH17","v":0.83997837981443046}]
[null,null,null,{"$f":"'User Inputs_FPI_Calculator'!AF18","v":"Natural Gas"},{"$f":"'User Inputs_FPI_Calculator'!AH18","v":0.84964100190581904}]
[null,null,null,{"$f":"'User Inputs_FPI_Calculator'!AF19","v":"Natural Gas"},{"$f":"'User Inputs_FPI_Calculator'!AH19","v":0.85317975071429641}]
[null,null,null,{"$f":"'User Inputs_FPI_Calculator'!AF20","v":"Natural Gas"},{"$f":"'User Inputs_FPI_Calculator'!AH20","v":0.85943128439233796}]
[null,null,null,{"$f":"'User Inputs_FPI_Calculator'!AF21","v":"Natural Gas"},{"$f":"'User Inputs_FPI_Calculator'!AH21","v":0.8672776264642148}]
[null,null,null,{"$f":"'User Inputs_FPI_Calculator'!AF22","v":"Natural Gas"},{"$f":"'User Inputs_FPI_Calculator'!AH22","v":0.87270542680714147}]
[null,null,null,{"$f":"'User Inputs_FPI_Calculator'!AF23","v":"Natural Gas"},{"$f":"'User Inputs_FPI_Calculator'!AH23","v":0.87547526337418469}]
[null,null,null,{"$f":"'User Inputs_FPI_Calculator'!AF24","v":"Natural Gas"},{"$f":"'User Inputs_FPI_Calculator'!AH24","v":0.87901817156262307}]
[null,null,null,{"$f":"'User Inputs_FPI_Calculator'!AF25","v":"Natural Gas"},{"$f":"'User Inputs_FPI_Calculator'!AH25","v":0.88505529277528905}]
[null,null,null,{"$f":"'User Inputs_FPI_Calculator'!AF26","v":"Natural Gas"},{"$f":"'User Inputs_FPI_Calculator'!AH26","v":0.94461290563621803}]
[null,null,null,{"$f":"'User Inputs_FPI_Calculator'!AF27","v":"Natural Gas"},{"$f":"'User Inputs_FPI_Calculator'!AH27","v":6.3462810817867572}]
[null,null,null,{"$f":"'User Inputs_FPI_Calculator'!AF28","v":"Natural Gas"},{"$f":"'User Inputs_FPI_Calculator'!AH28","v":-4.568570649654121}]
[null,null,{"$f":"IF('User Inputs_FPI_Calculator'!E3= \"FPI for v8.9 (adjusted for 30 yr UPV)\", 2, IF('User Inputs_FPI_Calculator'!E3= \"FPI_SCC for v8.9 (adjusted for 30 year UPV)\",2, \"\"))","v":2},{"$f":"'User Inputs_FPI_Calculator'!AF29","v":"Oil"},{"$f":"'User Inputs_FPI_Calculator'!AH29","v":1}]
[null,null,null,{"$f":"'User Inputs_FPI_Calculator'!AF30","v":"Oil"},{"$f":"'User Inputs_FPI_Calculator'!AH30","v":0.96744096993821582}]
[null,null,null,{"$f":"'User Inputs_FPI_Calculator'!AF31","v":"Oil"},{"$f":"'User Inputs_FPI_Calculator'!AH31","v":0.9296191683567282}]
[null,null,null,{"$f":"'User Inputs_FPI_Calculator'!AF32","v":"Oil"},{"$f":"'User Inputs_FPI_Calculator'!AH32","v":0.9115323557019096}]
[null,null,null,{"$f":"'User Inputs_FPI_Calculator'!AF33","v":"Oil"},{"$f":"'User Inputs_FPI_Calculator'!AH33","v":0.90150938135162406}]
[null,null,{"$f":"IF('User Inputs_FPI_Calculator'!E3= \"FPI for v10\", 1, IF('User Inputs_FPI_Calculator'!E3= \"FPI_SCC for v10\",1, \"\"))","v":""},{"$f":"'User Inputs_FPI_Calculator'!AF34","v":"Oil"},{"$f":"'User Inputs_FPI_Calculator'!AH34","v":0.89521292996080726}]
[null,null,null,{"$f":"'User Inputs_FPI_Calculator'!AF35","v":"Oil"},{"$f":"'User Inputs_FPI_Calculator'!AH35","v":0.89651472833991153}]
[null,null,null,{"$f":"'User Inputs_FPI_Calculator'!AF36","v":"Oil"},{"$f":"'User Inputs_FPI_Calculator'!AH36","v":0.8999237981239363}]
[null,null,null,{"$f":"'User Inputs_FPI_Calculator'!AF37","v":"Oil"},{"$f":"'User Inputs_FPI_Calculator'!AH37","v":0.90537020148663738}]
[null,null,null,{"$f":"'User Inputs_FPI_Calculator'!AF38","v":"Oil"},{"$f":"'User Inputs_FPI_Calculator'!AH38","v":0.91119118928362042}]
[null,null,null,{"$f":"'User Inputs_FPI_Calculator'!AF39","v":"Oil"},{"$f":"'User Inputs_FPI_Calculator'!AH39","v":0.91542689414764422}]
[null,null,null,{"$f":"'User Inputs_FPI_Calculator'!AF40","v":"Oil"},{"$f":"'User Inputs_FPI_Calculator'!AH40","v":0.92016740487084081}]
[null,null,null,{"$f":"'User Inputs_FPI_Calculator'!AF41","v":"Oil"},{"$f":"'User Inputs_FPI_Calculator'!AH41","v":0.92522202548435994}]
[null,null,null,{"$f":"'User Inputs_FPI_Calculator'!AF42","v":"Oil"},{"$f":"'User Inputs_FPI_Calculator'!AH42","v":0.92985968702895816}]
[null,null,null,{"$f":"'User Inputs_FPI_Calculator'!AF43","v":"Oil"},{"$f":"'User Inputs_FPI_Calculator'!AH43","v":0.93689255953688566}]
[null,null,null,{"$f":"'User Inputs_FPI_Calculator'!AF44","v":"Oil"},{"$f":"'User Inputs_FPI_Calculator'!AH44","v":0.93689255953688566}]
[null,null,null,{"$f":"'User Inputs_FPI_Calculator'!AF45","v":"Oil"},{"$f":"'User Inputs_FPI_Calculator'!AH45","v":0.94604834920142544}]
[null,null,null,{"$f":"'User Inputs_FPI_Calculator'!AF46","v":"Oil"},{"$f":"'User Inputs_FPI_Calculator'!AH46","v":0.95049477592143383}]
[null,null,null,{"$f":"'User Inputs_FPI_Calculator'!AF47","v":"Oil"},{"$f":"'User Inputs_FPI_Calculator'!AH47","v":0.95674782498027733}]
[null,null,null,{"$f":"'User Inputs_FPI_Calculator'!AF48","v":"Oil"},{"$f":"'User Inputs_FPI_Calculator'!AH48","v":0.9605850086171358}]
[null,null,null,{"$f":"'User Inputs_FPI_Calculator'!AF49","v":"Oil"},{"$f":"'User Inputs_FPI_Calculator'!AH49","v":0.96556782188143453}]
[null,null,null,{"$f":"'User Inputs_FPI_Calculator'!AF50","v":"Oil"},{"$f":"'User Inputs_FPI_Calculator'!AH50","v":0.96994747660376335}]
[null,null,null,{"$f":"'User Inputs_FPI_Calculator'!AF51","v":"Oil"},{"$f":"'User Inputs_FPI_Calculator'!AH51","v":0.97396696070359146}]
[null,null,null,{"$f":"'User Inputs_FPI_Calculator'!AF52","v":"Oil"},{"$f":"'User Inputs_FPI_Calculator'!AH52","v":0.98405895900413387}]
[null,null,null,{"$f":"'User Inputs_FPI_Calculator'!AF53","v":"Oil"},{"$f":"'User Inputs_FPI_Calculator'!AH53","v":6.4221432294747105}]
[null,null,null,{"$f":"'User Inputs_FPI_Calculator'!AF54","v":"Oil"},{"$f":"'User Inputs_FPI_Calculator'!AH54","v":-4.6030917570904002}]
[null,null,{"$f":"IF('User Inputs_FPI_Calculator'!E3= \"FPI for v8.9 (adjusted for 30 yr UPV)\", 3, IF('User Inputs_FPI_Calculator'!E3= \"FPI_SCC for v8.9 (adjusted for 30 year UPV)\",3, \"\"))","v":3},{"$f":"'User Inputs_FPI_Calculator'!AF55","v":"Electricity"},{"$f":"'User Inputs_FPI_Calculator'!AH55","v":1}]
[null,null,null,{"$f":"'User Inputs_FPI_Calculator'!AF56","v":"Electricity"},{"$f":"'User Inputs_FPI_Calculator'!AH56","v":0.94013512917764552}]
[null,null,null,{"$f":"'User Inputs_FPI_Calculator'!AF57","v":"Electricity"},{"$f":"'User Inputs_FPI_Calculator'!AH57","v":0.87158944043772812}]
[null,null,null,{"$f":"'User Inputs_FPI_Calculator'!AF58","v":"Electricity"},{"$f":"'User Inputs_FPI_Calculator'!AH58","v":0.84946776211430075}]
[null,null,null,{"$f":"'User Inputs_FPI_Calculator'!AF59","v":"Electricity"},{"$f":"'User Inputs_FPI_Calculator'!AH59","v":0.84512530839842193}]
[null,null,null,{"$f":"'User Inputs_FPI_Calculator'!AF60","v":"Electricity"},{"$f":"'User Inputs_FPI_Calculator'!AH60","v":0.84564516947866752}]
[null,null,null,{"$f":"'User Inputs_FPI_Calculator'!AF61","v":"Electricity"},{"$f":"'User Inputs_FPI_Calculator'!AH61","v":0.84726671797188313}]
[null,null,null,{"$f":"'User Inputs_FPI_Calculator'!AF62","v":"Electricity"},{"$f":"'User Inputs_FPI_Calculator'!AH62","v":0.85075500740042775}]
[null,null,null,{"$f":"'User Inputs_FPI_Calculator'!AF63","v":"Electricity"},{"$f":"'User Inputs_FPI_Calculator'!AH63","v":0.85789638148666936}]
[null,null,null,{"$f":"'User Inputs_FPI_Calculator'!AF64","v":"Electricity"},{"$f":"'User Inputs_FPI_Calculator'!AH64","v":0.86733719205736348}]
[null,null,{"$f":"IF('User Inputs_FPI_Calculator'!E3= \"FPI for v10\", 4, IF('User Inputs_FPI_Calculator'!E3= \"FPI_SCC for v10\",4, \"\"))","v":""},{"$f":"'User Inputs_FPI_Calculator'!AF65","v":"Electricity"},{"$f":"'User Inputs_FPI_Calculator'!AH65","v":0.87725271643111047}]
[null,null,null,{"$f":"'User Inputs_FPI_Calculator'!AF66","v":"Electricity"},{"$f":"'User Inputs_FPI_Calculator'!AH66","v":0.88814230433942498}]
[null,null,null,{"$f":"'User Inputs_FPI_Calculator'!AF67","v":"Electricity"},{"$f":"'User Inputs_FPI_Calculator'!AH67","v":0.89397286574054513}]
[null,null,null,{"$f":"'User Inputs_FPI_Calculator'!AF68","v":"Electricity"},{"$f":"'User Inputs_FPI_Calculator'!AH68","v":0.89948570213169665}]
[null,null,null,{"$f":"'User Inputs_FPI_Calculator'!AF69","v":"Electricity"},{"$f":"'User Inputs_FPI_Calculator'!AH69","v":0.90772953783683652}]
[null,null,null,{"$f":"'User Inputs_FPI_Calculator'!AF70","v":"Electricity"},{"$f":"'User Inputs_FPI_Calculator'!AH70","v":0.91821658550496765}]
[null,null,null,{"$f":"'User Inputs_FPI_Calculator'!AF71","v":"Electricity"},{"$f":"'User Inputs_FPI_Calculator'!AH71","v":0.92745230338578988}]
[null,null,null,{"$f":"'User Inputs_FPI_Calculator'!AF72","v":"Electricity"},{"$f":"'User Inputs_FPI_Calculator'!AH72","v":0.9357518810019565}]
[null,null,null,{"$f":"'User Inputs_FPI_Calculator'!AF73","v":"Electricity"},{"$f":"'User Inputs_FPI_Calculator'!AH73","v":0.9438556273710208}]
[null,null,null,{"$f":"'User Inputs_FPI_Calculator'!AF74","v":"Electricity"},{"$f":"'User Inputs_FPI_Calculator'!AH74","v":0.9520221789169242}]
[null,null,null,{"$f":"'User Inputs_FPI_Calculator'!AF75","v":"Electricity"},{"$f":"'User Inputs_FPI_Calculator'!AH75","v":0.95929276124420948}]
[null,null,null,{"$f":"'User Inputs_FPI_Calculator'!AF76","v":"Electricity"},{"$f":"'User Inputs_FPI_Calculator'!AH76","v":0.96886906159701491}]
[null,null,null,{"$f":"'User Inputs_FPI_Calculator'!AF77","v":"Electricity"},{"$f":"'User Inputs_FPI_Calculator'!AH77","v":0.97698611740366148}]
[null,null,null,{"$f":"'User Inputs_FPI_Calculator'!AF78","v":"Electricity"},{"$f":"'User Inputs_FPI_Calculator'!AH78","v":0.9842581552238463}]
[null,null,null,{"$f":"'User Inputs_FPI_Calculator'!AF79","v":"Electricity"},{"$f":"'User Inputs_FPI_Calculator'!AH79","v":6.4002935504658378}]
[null,null,null,{"$f":"'User Inputs_FPI_Calculator'!AF80","v":"Electricity"},{"$f":"'User Inputs_FPI_Calculator'!AH80","v":-4.5818544727261985}]
[null,null,{"$f":"IF('User Inputs_FPI_Calculator'!E3= \"FPI for v8.9 (adjusted for 30 yr UPV)\", 4, IF('User Inputs_FPI_Calculator'!E3= \"FPI_SCC for v8.9 (adjusted for 30 year UPV)\",4, \"\"))","v":4},{"$f":"'User Inputs_FPI_Calculator'!AF81","v":"Propane"},{"$f":"'User Inputs_FPI_Calculator'!AH81","v":1}]
[null,null,null,{"$f":"'User Inputs_FPI_Calculator'!AF82","v":"Propane"},{"$f":"'User Inputs_FPI_Calculator'!AH82","v":1.0225543509037718}]
[null,null,null,{"$f":"'User Inputs_FPI_Calculator'!AF83","v":"Propane"},{"$f":"'User Inputs_FPI_Calculator'!AH83","v":1.0029107349278659}]
[null,null,null,{"$f":"'User Inputs_FPI_Calculator'!AF84","v":"Propane"},{"$f":"'User Inputs_FPI_Calculator'!AH84","v":0.97362856311983892}]
[null,null,null,{"$f":"'User Inputs_FPI_Calculator'!AF85","v":"Propane"},{"$f":"'User Inputs_FPI_Calculator'!AH85","v":0.94877516487096869}]
[null,null,null,{"$f":"'User Inputs_FPI_Calculator'!AF86","v":"Propane"},{"$f":"'User Inputs_FPI_Calculator'!AH86","v":0.93573302800871294}]
[null,null,null,{"$f":"'User Inputs_FPI_Calculator'!AF87","v":"Propane"},{"$f":"'User Inputs_FPI_Calculator'!AH87","v":0.93001632971141923}]
[null,null,null,{"$f":"'User Inputs_FPI_Calculator'!AF88","v":"Propane"},{"$f":"'User Inputs_FPI_Calculator'!AH88","v":0.93256961321707676}]
[null,null,null,{"$f":"'User Inputs_FPI_Calculator'!AF89","v":"Propane"},{"$f":"'User Inputs_FPI_Calculator'!AH89","v":0.9413873687011719}]
[null,null,null,{"$f":"'User Inputs_FPI_Calculator'!AF90","v":"Propane"},{"$f":"'User Inputs_FPI_Calculator'!AH90","v":0.95536981217833505}]
[null,null,null,{"$f":"'User Inputs_FPI_Calculator'!AF91","v":"Propane"},{"$f":"'User Inputs_FPI_Calculator'!AH91","v":0.97329518985739738}]
[null,null,null,{"$f":"'User Inputs_FPI_Calculator'!AF92","v":"Propane"},{"$f":"'User Inputs_FPI_Calculator'!AH92","v":0.99213448889661426}]
[null,null,null,{"$f":"'User Inputs_FPI_Calculator'!AF93","v":"Propane"},{"$f":"'User Inputs_FPI_Calculator'!AH93","v":1.0084799338451442}]
[null,null,null,{"$f":"'User Inputs_FPI_Calculator'!AF94","v":"Propane"},{"$f":"'User Inputs_FPI_Calculator'!AH94","v":1.0214584162516123}]
[null,null,null,{"$f":"'User Inputs_FPI_Calculator'!AF95","v":"Propane"},{"$f":"'User Inputs_FPI_Calculator'!AH95","v":1.0349131728630421}]
[null,null,{"$f":"IF('User Inputs_FPI_Calculator'!E3= \"FPI for v10\", 2, IF('User Inputs_FPI_Calculator'!E3= \"FPI_SCC for v10\",2, \"\"))","v":""},{"$f":"'User Inputs_FPI_Calculator'!AF96","v":"Propane"},{"$f":"'User Inputs_FPI_Calculator'!AH96","v":1.0479082539146745}]
[null,null,null,{"$f":"'User Inputs_FPI_Calculator'!AF97","v":"Propane"},{"$f":"'User Inputs_FPI_Calculator'!AH97","v":1.0571079560195109}]
[null,null,null,{"$f":"'User Inputs_FPI_Calculator'!AF98","v":"Propane"},{"$f":"'User Inputs_FPI_Calculator'!AH98","v":1.067462819760947}]
[null,null,null,{"$f":"'User Inputs_FPI_Calculator'!AF99","v":"Propane"},{"$f":"'User Inputs_FPI_Calculator'!AH99","v":1.0785726032827161}]
[null,null,null,{"$f":"'User Inputs_FPI_Calculator'!AF100","v":"Propane"},{"$f":"'User Inputs_FPI_Calculator'!AH100","v":1.0876928978873526}]
[null,null,null,{"$f":"'User Inputs_FPI_Calculator'!AF101","v":"Propane"},{"$f":"'User Inputs_FPI_Calculator'!AH101","v":1.0938155410553203}]
[null,null,null,{"$f":"'User Inputs_FPI_Calculator'!AF102","v":"Propane"},{"$f":"'User Inputs_FPI_Calculator'!AH102","v":1.0994325757570367}]
[null,null,null,{"$f":"'User Inputs_FPI_Calculator'!AF103","v":"Propane"},{"$f":"'User Inputs_FPI_Calculator'!AH103","v":1.1041964866176772}]
[null,null,null,{"$f":"'User Inputs_FPI_Calculator'!AF104","v":"Propane"},{"$f":"'User Inputs_FPI_Calculator'!AH104","v":1.1307843479014483}]
[null,null,null,{"$f":"'User Inputs_FPI_Calculator'!AF105","v":"Propane"},{"$f":"'User Inputs_FPI_Calculator'!AH105","v":7.4123542413854793}]
[null,null,null,{"$f":"'User Inputs_FPI_Calculator'!AF106","v":"Propane"},{"$f":"'User Inputs_FPI_Calculator'!AH106","v":-5.313515908237024}]
[null,null,{"$f":"IF('User Inputs_FPI_Calculator'!E3= \"FPI for v8.9 (adjusted for 30 yr UPV)\", 5, IF('User Inputs_FPI_Calculator'!E3= \"FPI_SCC for v8.9 (adjusted for 30 year UPV)\",5, \"\"))","v":5},{"$f":"'User Inputs_FPI_Calculator'!AF107","v":"Wood"},{"$f":"'User Inputs_FPI_Calculator'!AH107","v":1}]
[null,null,null,{"$f":"'User Inputs_FPI_Calculator'!AF108","v":"Wood"},{"$f":"'User Inputs_FPI_Calculator'!AH108","v":1.0049806756849258}]
[null,null,null,{"$f":"'User Inputs_FPI_Calculator'!AF109","v":"Wood"},{"$f":"'User Inputs_FPI_Calculator'!AH109","v":1.0099613513698513}]
[null,null,null,{"$f":"'User Inputs_FPI_Calculator'!AF110","v":"Wood"},{"$f":"'User Inputs_FPI_Calculator'!AH110","v":1.0149420270547771}]
[null,null,null,{"$f":"'User Inputs_FPI_Calculator'!AF111","v":"Wood"},{"$f":"'User Inputs_FPI_Calculator'!AH111","v":1.0199227027397026}]
[null,null,null,{"$f":"'User Inputs_FPI_Calculator'!AF112","v":"Wood"},{"$f":"'User Inputs_FPI_Calculator'!AH112","v":1.0298840541095542}]
[null,null,null,{"$f":"'User Inputs_FPI_Calculator'!AF113","v":"Wood"},{"$f":"'User Inputs_FPI_Calculator'!AH113","v":1.03486472979448}]
[null,null,null,{"$f":"'User Inputs_FPI_Calculator'!AF114","v":"Wood"},{"$f":"'User Inputs_FPI_Calculator'!AH114","v":1.0398454054794057}]
[null,null,null,{"$f":"'User Inputs_FPI_Calculator'!AF115","v":"Wood"},{"$f":"'User Inputs_FPI_Calculator'!AH115","v":1.0448260811643313}]
[null,null,null,{"$f":"'User Inputs_FPI_Calculator'!AF116","v":"Wood"},{"$f":"'User Inputs_FPI_Calculator'!AH116","v":1.0498067568492571}]
[null,null,null,{"$f":"'User Inputs_FPI_Calculator'!AF117","v":"Wood"},{"$f":"'User Inputs_FPI_Calculator'!AH117","v":1.0547874325341828}]
[null,null,null,{"$f":"'User Inputs_FPI_Calculator'!AF118","v":"Wood"},{"$f":"'User Inputs_FPI_Calculator'!AH118","v":1.0597681082191086}]
[null,null,null,{"$f":"'User Inputs_FPI_Calculator'!AF119","v":"Wood"},{"$f":"'User Inputs_FPI_Calculator'!AH119","v":1.0647487839040344}]
[null,null,null,{"$f":"'User Inputs_FPI_Calculator'!AF120","v":"Wood"},{"$f":"'User Inputs_FPI_Calculator'!AH120","v":1.0697294595889599}]
[null,null,null,{"$f":"'User Inputs_FPI_Calculator'!AF121","v":"Wood"},{"$f":"'User Inputs_FPI_Calculator'!AH121","v":1.0796908109588113}]
[null,null,null,{"$f":"'User Inputs_FPI_Calculator'!AF122","v":"Wood"},{"$f":"'User Inputs_FPI_Calculator'!AH122","v":1.084671486643737}]
[null,null,null,{"$f":"'User Inputs_FPI_Calculator'!AF123","v":"Wood"},{"$f":"'User Inputs_FPI_Calculator'!AH123","v":1.0896521623286628}]
[null,null,null,{"$f":"'User Inputs_FPI_Calculator'!AF124","v":"Wood"},{"$f":"'User Inputs_FPI_Calculator'!AH124","v":1.0946328380135886}]
[null,null,null,{"$f":"'User Inputs_FPI_Calculator'!AF125","v":"Wood"},{"$f":"'User Inputs_FPI_Calculator'!AH125","v":1.0996135136985139}]
[null,null,null,{"$f":"'User Inputs_FPI_Calculator'!AF126","v":"Wood"},{"$f":"'User Inputs_FPI_Calculator'!AH126","v":1.1045941893834397}]
[null,null,{"$f":"IF('User Inputs_FPI_Calculator'!E3= \"FPI for v10\", 7, IF('User Inputs_FPI_Calculator'!E3= \"FPI_SCC for v10\",7, \"\"))","v":""},{"$f":"'User Inputs_FPI_Calculator'!AF127","v":"Wood"},{"$f":"'User Inputs_FPI_Calculator'!AH127","v":1.1095748650683654}]
[null,null,null,{"$f":"'User Inputs_FPI_Calculator'!AF128","v":"Wood"},{"$f":"'User Inputs_FPI_Calculator'!AH128","v":1.119536216438217}]
[null,null,null,{"$f":"'User Inputs_FPI_Calculator'!AF129","v":"Wood"},{"$f":"'User Inputs_FPI_Calculator'!AH129","v":1.1245168921231428}]
[null,null,null,{"$f":"'User Inputs_FPI_Calculator'!AF130","v":"Wood"},{"$f":"'User Inputs_FPI_Calculator'!AH130","v":1.1294975678080683}]
[null,null,null,{"$f":"'User Inputs_FPI_Calculator'!AF131","v":"Wood"},{"$f":"'User Inputs_FPI_Calculator'!AH131","v":7.3770856987033842}]
[null,null,null,{"$f":"'User Inputs_FPI_Calculator'!AF132","v":"Wood"},{"$f":"'User Inputs_FPI_Calculator'!AH132","v":-5.2904267596887777}]
[null,null,{"$f":"IF('User Inputs_FPI_Calculator'!E3= \"FPI for v8.9 (adjusted for 30 yr UPV)\", 6, IF('User Inputs_FPI_Calculator'!E3= \"FPI_SCC for v8.9 (adjusted for 30 year UPV)\",6, \"\"))","v":6},{"$f":"'User Inputs_FPI_Calculator'!AF133","v":"Coal"},{"$f":"'User Inputs_FPI_Calculator'!AH133","v":1}]
[null,null,null,{"$f":"'User Inputs_FPI_Calculator'!AF134","v":"Coal"},{"$f":"'User Inputs_FPI_Calculator'!AH134","v":0.99958037539727507}]
[null,null,null,{"$f":"'User Inputs_FPI_Calculator'!AF135","v":"Coal"},{"$f":"'User Inputs_FPI_Calculator'!AH135","v":1.0154324603239135}]
[null,null,null,{"$f":"'User Inputs_FPI_Calculator'!AF136","v":"Coal"},{"$f":"'User Inputs_FPI_Calculator'!AH136","v":1.0230917597032092}]
[null,null,null,{"$f":"'User Inputs_FPI_Calculator'!AF137","v":"Coal"},{"$f":"'User Inputs_FPI_Calculator'!AH137","v":1.0199693294193084}]
[null,null,null,{"$f":"'User Inputs_FPI_Calculator'!AF138","v":"Coal"},{"$f":"'User Inputs_FPI_Calculator'!AH138","v":1.0125766577111781}]
[null,null,null,{"$f":"'User Inputs_FPI_Calculator'!AF139","v":"Coal"},{"$f":"'User Inputs_FPI_Calculator'!AH139","v":1.0072756330471637}]
[null,null,null,{"$f":"'User Inputs_FPI_Calculator'!AF140","v":"Coal"},{"$f":"'User Inputs_FPI_Calculator'!AH140","v":1.0031508877058128}]
[null,null,null,{"$f":"'User Inputs_FPI_Calculator'!AF141","v":"Coal"},{"$f":"'User Inputs_FPI_Calculator'!AH141","v":0.998864722589065}]
[null,null,null,{"$f":"'User Inputs_FPI_Calculator'!AF142","v":"Coal"},{"$f":"'User Inputs_FPI_Calculator'!AH142","v":0.99395382073894578}]
[null,null,null,{"$f":"'User Inputs_FPI_Calculator'!AF143","v":"Coal"},{"$f":"'User Inputs_FPI_Calculator'!AH143","v":0.98999259627037806}]
[null,null,null,{"$f":"'User Inputs_FPI_Calculator'!AF144","v":"Coal"},{"$f":"'User Inputs_FPI_Calculator'!AH144","v":0.98754377488635114}]
[null,null,null,{"$f":"'User Inputs_FPI_Calculator'!AF145","v":"Coal"},{"$f":"'User Inputs_FPI_Calculator'!AH145","v":0.98550263565661234}]
[null,null,null,{"$f":"'User Inputs_FPI_Calculator'!AF146","v":"Coal"},{"$f":"'User Inputs_FPI_Calculator'!AH146","v":0.983826355068257}]
[null,null,null,{"$f":"'User Inputs_FPI_Calculator'!AF147","v":"Coal"},{"$f":"'User Inputs_FPI_Calculator'!AH147","v":0.98293976559455631}]
[null,null,null,{"$f":"'User Inputs_FPI_Calculator'!AF148","v":"Coal"},{"$f":"'User Inputs_FPI_Calculator'!AH148","v":0.98280573923407222}]
[null,null,null,{"$f":"'User Inputs_FPI_Calculator'!AF149","v":"Coal"},{"$f":"'User Inputs_FPI_Calculator'!AH149","v":0.98242345287969679}]
[null,null,null,{"$f":"'User Inputs_FPI_Calculator'!AF150","v":"Coal"},{"$f":"'User Inputs_FPI_Calculator'!AH150","v":0.98069830369882582}]
[null,null,null,{"$f":"'User Inputs_FPI_Calculator'!AF151","v":"Coal"},{"$f":"'User Inputs_FPI_Calculator'!AH151","v":0.97898990127258756}]
[null,null,null,{"$f":"'User Inputs_FPI_Calculator'!AF152","v":"Coal"},{"$f":"'User Inputs_FPI_Calculator'!AH152","v":0.97734247820694897}]
[null,null,null,{"$f":"'User Inputs_FPI_Calculator'!AF153","v":"Coal"},{"$f":"'User Inputs_FPI_Calculator'!AH153","v":0.97725979661604012}]
[null,null,null,{"$f":"'User Inputs_FPI_Calculator'!AF154","v":"Coal"},{"$f":"'User Inputs_FPI_Calculator'!AH154","v":0.97796753592336461}]
[null,null,null,{"$f":"'User Inputs_FPI_Calculator'!AF155","v":"Coal"},{"$f":"'User Inputs_FPI_Calculator'!AH155","v":0.97985988033346649}]
[null,null,null,{"$f":"'User Inputs_FPI_Calculator'!AF156","v":"Coal"},{"$f":"'User Inputs_FPI_Calculator'!AH156","v":0.9801098274443335}]
[null,null,null,{"$f":"'User Inputs_FPI_Calculator'!AF157","v":"Coal"},{"$f":"'User Inputs_FPI_Calculator'!AH157","v":6.2986048529765206}]
[null,null,{"$f":"IF('User Inputs_FPI_Calculator'!E3= \"FPI for v10\", 5, IF('User Inputs_FPI_Calculator'!E3= \"FPI_SCC for v10\",5, \"\"))","v":""},{"$f":"'User Inputs_FPI_Calculator'!AF158","v":"Coal"},{"$f":"'User Inputs_FPI_Calculator'!AH158","v":-4.4961003834566755}]
[null,null,{"$f":"IF('User Inputs_FPI_Calculator'!E3= \"FPI for v8.9 (adjusted for 30 yr UPV)\", 7, IF('User Inputs_FPI_Calculator'!E3= \"FPI_SCC for v8.9 (adjusted for 30 year UPV)\",7, \"\"))","v":7},{"$f":"'User Inputs_FPI_Calculator'!AF159","v":"Kerosene"},{"$f":"'User Inputs_FPI_Calculator'!AH159","v":1}]
[null,null,null,{"$f":"'User Inputs_FPI_Calculator'!AF160","v":"Kerosene"},{"$f":"'User Inputs_FPI_Calculator'!AH160","v":0.96771386467472953}]
[null,null,null,{"$f":"'User Inputs_FPI_Calculator'!AF161","v":"Kerosene"},{"$f":"'User Inputs_FPI_Calculator'!AH161","v":0.93019288448142434}]
[null,null,null,{"$f":"'User Inputs_FPI_Calculator'!AF162","v":"Kerosene"},{"$f":"'User Inputs_FPI_Calculator'!AH162","v":0.91230217041628336}]
[null,null,null,{"$f":"'User Inputs_FPI_Calculator'!AF163","v":"Kerosene"},{"$f":"'User Inputs_FPI_Calculator'!AH163","v":0.9024325042737259}]
[null,null,null,{"$f":"'User Inputs_FPI_Calculator'!AF164","v":"Kerosene"},{"$f":"'User Inputs_FPI_Calculator'!AH164","v":0.89636970823202466}]
[null,null,null,{"$f":"'User Inputs_FPI_Calculator'!AF165","v":"Kerosene"},{"$f":"'User Inputs_FPI_Calculator'!AH165","v":0.8977647204404382}]
[null,null,null,{"$f":"'User Inputs_FPI_Calculator'!AF166","v":"Kerosene"},{"$f":"'User Inputs_FPI_Calculator'!AH166","v":0.90125582191632325}]
[null,null,null,{"$f":"'User Inputs_FPI_Calculator'!AF167","v":"Kerosene"},{"$f":"'User Inputs_FPI_Calculator'!AH167","v":0.90677344595524934}]
[null,null,null,{"$f":"'User Inputs_FPI_Calculator'!AF168","v":"Kerosene"},{"$f":"'User Inputs_FPI_Calculator'!AH168","v":0.91266366671362364}]
[null,null,null,{"$f":"'User Inputs_FPI_Calculator'!AF169","v":"Kerosene"},{"$f":"'User Inputs_FPI_Calculator'!AH169","v":0.91697701676900156}]
[null,null,null,{"$f":"'User Inputs_FPI_Calculator'!AF170","v":"Kerosene"},{"$f":"'User Inputs_FPI_Calculator'!AH170","v":0.92179249395479912}]
[null,null,null,{"$f":"'User Inputs_FPI_Calculator'!AF171","v":"Kerosene"},{"$f":"'User Inputs_FPI_Calculator'!AH171","v":0.92692041422143312}]
[null,null,null,{"$f":"'User Inputs_FPI_Calculator'!AF172","v":"Kerosene"},{"$f":"'User Inputs_FPI_Calculator'!AH172","v":0.931633587993003}]
[null,null,null,{"$f":"'User Inputs_FPI_Calculator'!AF173","v":"Kerosene"},{"$f":"'User Inputs_FPI_Calculator'!AH173","v":0.93882938441431851}]
[null,null,null,{"$f":"'User Inputs_FPI_Calculator'!AF174","v":"Kerosene"},{"$f":"'User Inputs_FPI_Calculator'!AH174","v":0.94377250730470608}]
[null,null,null,{"$f":"'User Inputs_FPI_Calculator'!AF175","v":"Kerosene"},{"$f":"'User Inputs_FPI_Calculator'!AH175","v":0.94813683283134542}]
[null,null,null,{"$f":"'User Inputs_FPI_Calculator'!AF176","v":"Kerosene"},{"$f":"'User Inputs_FPI_Calculator'!AH176","v":0.95265978655700501}]
[null,null,null,{"$f":"'User Inputs_FPI_Calculator'!AF177","v":"Kerosene"},{"$f":"'User Inputs_FPI_Calculator'!AH177","v":0.95897977586430039}]
[null,null,null,{"$f":"'User Inputs_FPI_Calculator'!AF178","v":"Kerosene"},{"$f":"'User Inputs_FPI_Calculator'!AH178","v":0.96289671942682198}]
[null,null,null,{"$f":"'User Inputs_FPI_Calculator'!AF179","v":"Kerosene"},{"$f":"'User Inputs_FPI_Calculator'!AH179","v":0.96795321338658591}]
[null,null,null,{"$f":"'User Inputs_FPI_Calculator'!AF180","v":"Kerosene"},{"$f":"'User Inputs_FPI_Calculator'!AH180","v":0.97250987119876353}]
[null,null,null,{"$f":"'User Inputs_FPI_Calculator'!AF181","v":"Kerosene"},{"$f":"'User Inputs_FPI_Calculator'!AH181","v":0.97660814785534833}]
[null,null,null,{"$f":"'User Inputs_FPI_Calculator'!AF182","v":"Kerosene"},{"$f":"'User Inputs_FPI_Calculator'!AH182","v":0.98674671519920054}]
[null,null,null,{"$f":"'User Inputs_FPI_Calculator'!AF183","v":"Kerosene"},{"$f":"'User Inputs_FPI_Calculator'!AH183","v":6.4414127895891449}]
[null,null,null,{"$f":"'User Inputs_FPI_Calculator'!AF184","v":"Kerosene"},{"$f":"'User Inputs_FPI_Calculator'!AH184","v":-4.6172545840696948}]
[null,null,{"$f":"IF('User Inputs_FPI_Calculator'!E3= \"FPI for v8.9 (adjusted for 30 yr UPV)\", 8, IF('User Inputs_FPI_Calculator'!E3= \"FPI_SCC for v8.9 (adjusted for 30 year UPV)\",8, \"\"))","v":8},{"$f":"'User Inputs_FPI_Calculator'!AF185","v":"Other"},{"$f":"'User Inputs_FPI_Calculator'!AH185","v":1}]
[null,null,null,{"$f":"'User Inputs_FPI_Calculator'!AF186","v":"Other"},{"$f":"'User Inputs_FPI_Calculator'!AH186","v":1}]
[null,null,null,{"$f":"'User Inputs_FPI_Calculator'!AF187","v":"Other"},{"$f":"'User Inputs_FPI_Calculator'!AH187","v":1}]
[null,null,null,{"$f":"'User Inputs_FPI_Calculator'!AF188","v":"Other"},{"$f":"'User Inputs_FPI_Calculator'!AH188","v":1}]
[null,null,{"$f":"IF('User Inputs_FPI_Calculator'!E3= \"FPI for v10\", 6, IF('User Inputs_FPI_Calculator'!E3= \"FPI_SCC for v10\",6, \"\"))","v":""},{"$f":"'User Inputs_FPI_Calculator'!AF189","v":"Other"},{"$f":"'User Inputs_FPI_Calculator'!AH189","v":1}]
[null,null,null,{"$f":"'User Inputs_FPI_Calculator'!AF190","v":"Other"},{"$f":"'User Inputs_FPI_Calculator'!AH190","v":1}]
[null,null,null,{"$f":"'User Inputs_FPI_Calculator'!AF191","v":"Other"},{"$f":"'User Inputs_FPI_Calculator'!AH191","v":1}]
[null,null,null,{"$f":"'User Inputs_FPI_Calculator'!AF192","v":"Other"},{"$f":"'User Inputs_FPI_Calculator'!AH192","v":1}]
[null,null,null,{"$f":"'User Inputs_FPI_Calculator'!AF193","v":"Other"},{"$f":"'User Inputs_FPI_Calculator'!AH193","v":1}]
[null,null,null,{"$f":"'User Inputs_FPI_Calculator'!AF194","v":"Other"},{"$f":"'User Inputs_FPI_Calculator'!AH194","v":1}]
[null,null,null,{"$f":"'User Inputs_FPI_Calculator'!AF195","v":"Other"},{"$f":"'User Inputs_FPI_Calculator'!AH195","v":1}]
[null,null,null,{"$f":"'User Inputs_FPI_Calculator'!AF196","v":"Other"},{"$f":"'User Inputs_FPI_Calculator'!AH196","v":1}]
[null,null,null,{"$f":"'User Inputs_FPI_Calculator'!AF197","v":"Other"},{"$f":"'User Inputs_FPI_Calculator'!AH197","v":1}]
[null,null,null,{"$f":"'User Inputs_FPI_Calculator'!AF198","v":"Other"},{"$f":"'User Inputs_FPI_Calculator'!AH198","v":1}]
[null,null,null,{"$f":"'User Inputs_FPI_Calculator'!AF199","v":"Other"},{"$f":"'User Inputs_FPI_Calculator'!AH199","v":1}]
[null,null,null,{"$f":"'User Inputs_FPI_Calculator'!AF200","v":"Other"},{"$f":"'User Inputs_FPI_Calculator'!AH200","v":1}]
[null,null,null,{"$f":"'User Inputs_FPI_Calculator'!AF201","v":"Other"},{"$f":"'User Inputs_FPI_Calculator'!AH201","v":1}]
[null,null,null,{"$f":"'User Inputs_FPI_Calculator'!AF202","v":"Other"},{"$f":"'User Inputs_FPI_Calculator'!AH202","v":1}]
[null,null,null,{"$f":"'User Inputs_FPI_Calculator'!AF203","v":"Other"},{"$f":"'User Inputs_FPI_Calculator'!AH203","v":1}]
[null,null,null,{"$f":"'User Inputs_FPI_Calculator'!AF204","v":"Other"},{"$f":"'User Inputs_FPI_Calculator'!AH204","v":1}]
[null,null,null,{"$f":"'User Inputs_FPI_Calculator'!AF205","v":"Other"},{"$f":"'User Inputs_FPI_Calculator'!AH205","v":1}]
[null,null,null,{"$f":"'User Inputs_FPI_Calculator'!AF206","v":"Other"},{"$f":"'User Inputs_FPI_Calculator'!AH206","v":1}]
[null,null,null,{"$f":"'User Inputs_FPI_Calculator'!AF207","v":"Other"},{"$f":"'User Inputs_FPI_Calculator'!AH207","v":1}]
[null,null,null,{"$f":"'User Inputs_FPI_Calculator'!AF208","v":"Other"},{"$f":"'User Inputs_FPI_Calculator'!AH208","v":1}]
[null,null,null,{"$f":"'User Inputs_FPI_Calculator'!AF209","v":"Other"},{"$f":"'User Inputs_FPI_Calculator'!AH209","v":6.4171914438781892}]
[null,null,null,{"$f":"'User Inputs_FPI_Calculator'!AF210","v":"Other"},{"$f":"'User Inputs_FPI_Calculator'!AH210","v":-4.5797071871945407}]
[null,null,null,{"$f":"'User Inputs_FPI_Calculator'!AF211","v":"  "},{"$f":"'User Inputs_FPI_Calculator'!AH211","v":"  "}]
[null,null,null,{"$f":"'User Inputs_FPI_Calculator'!AF212","v":"  "},{"$f":"'User Inputs_FPI_Calculator'!AH212","v":"  "}]
[null,null,null,{"$f":"'User Inputs_FPI_Calculator'!AF213","v":"  "},{"$f":"'User Inputs_FPI_Calculator'!AH213","v":"  "}]
[null,null,null,{"$f":"'User Inputs_FPI_Calculator'!AF214","v":"  "},{"$f":"'User Inputs_FPI_Calculator'!AH214","v":"  "}]
[null,null,null,{"$f":"'User Inputs_FPI_Calculator'!AF215","v":"  "},{"$f":"'User Inputs_FPI_Calculator'!AH215","v":"  "}]
[null,null,null,{"$f":"'User Inputs_FPI_Calculator'!AF216","v":"  "},{"$f":"'User Inputs_FPI_Calculator'!AH216","v":"  "}]
[null,null,null,{"$f":"'User Inputs_FPI_Calculator'!AF217","v":"  "},{"$f":"'User Inputs_FPI_Calculator'!AH217","v":"  "}]
[null,null,null,{"$f":"'User Inputs_FPI_Calculator'!AF218","v":"  "},{"$f":"'User Inputs_FPI_Calculator'!AH218","v":"  "}]
[null,null,null,{"$f":"'User Inputs_FPI_Calculator'!AF219","v":"  "},{"$f":"'User Inputs_FPI_Calculator'!AH219","v":"  "}]
[null,null,{"$f":"IF('User Inputs_FPI_Calculator'!E3= \"FPI for v10\", 8, IF('User Inputs_FPI_Calculator'!E3= \"FPI_SCC for v10\",8, \"\"))","v":""},{"$f":"'User Inputs_FPI_Calculator'!AF220","v":"  "},{"$f":"'User Inputs_FPI_Calculator'!AH220","v":"  "}]
[null,null,null,{"$f":"'User Inputs_FPI_Calculator'!AF221","v":"  "},{"$f":"'User Inputs_FPI_Calculator'!AH221","v":"  "}]
[null,null,null,{"$f":"'User Inputs_FPI_Calculator'!AF222","v":"  "},{"$f":"'User Inputs_FPI_Calculator'!AH222","v":"  "}]
[null,null,null,{"$f":"'User Inputs_FPI_Calculator'!AF223","v":"  "},{"$f":"'User Inputs_FPI_Calculator'!AH223","v":"  "}]
[null,null,null,{"$f":"'User Inputs_FPI_Calculator'!AF224","v":"  "},{"$f":"'User Inputs_FPI_Calculator'!AH224","v":"  "}]
[null,null,null,{"$f":"'User Inputs_FPI_Calculator'!AF225","v":"  "},{"$f":"'User Inputs_FPI_Calculator'!AH225","v":"  "}]
[null,null,null,{"$f":"'User Inputs_FPI_Calculator'!AF226","v":"  "},{"$f":"'User Inputs_FPI_Calculator'!AH226","v":"  "}]
[null,null,null,{"$f":"'User Inputs_FPI_Calculator'!AF227","v":"  "},{"$f":"'User Inputs_FPI_Calculator'!AH227","v":"  "}]
[null,null,null,{"$f":"'User Inputs_FPI_Calculator'!AF228","v":"  "},{"$f":"'User Inputs_FPI_Calculator'!AH228","v":"  "}]
[null,null,null,{"$f":"'User Inputs_FPI_Calculator'!AF229","v":"  "},{"$f":"'User Inputs_FPI_Calculator'!AH229","v":"  "}]
[null,null,null,{"$f":"'User Inputs_FPI_Calculator'!AF230","v":"  "},{"$f":"'User Inputs_FPI_Calculator'!AH230","v":"  "}]
[null,null,null,{"$f":"'User Inputs_FPI_Calculator'!AF231","v":"  "},{"$f":"'User Inputs_FPI_Calculator'!AH231","v":"  "}]
[null,null,null,{"$f":"'User Inputs_FPI_Calculator'!AF232","v":"  "},{"$f":"'User Inputs_FPI_Calculator'!AH232","v":"  "}]
[null,null,null,{"$f":"'User Inputs_FPI_Calculator'!AF233","v":"  "},{"$f":"'User Inputs_FPI_Calculator'!AH233","v":"  "}]
[null,null,null,{"$f":"'User Inputs_FPI_Calculator'!AF234","v":"  "},{"$f":"'User Inputs_FPI_Calculator'!AH234","v":"  "}]
[null,null,null,{"$f":"'User Inputs_FPI_Calculator'!AF235","v":"  "},{"$f":"'User Inputs_FPI_Calculator'!AH235","v":"  "}]
[null,null,null,{"$f":"'User Inputs_FPI_Calculator'!AF236","v":"  "},{"$f":"'User Inputs_FPI_Calculator'!AH236","v":"  "}]
[null,null,null,{"$f":"'User Inputs_FPI_Calculator'!AF237","v":"  "},{"$f":"'User Inputs_FPI_Calculator'!AH237","v":"  "}]
[null,null,null,{"$f":"'User Inputs_FPI_Calculator'!AF238","v":"  "},{"$f":"'User Inputs_FPI_Calculator'!AH238","v":"  "}]
[null,null,null,{"$f":"'User Inputs_FPI_Calculator'!AF239","v":"  "},{"$f":"'User Inputs_FPI_Calculator'!AH239","v":"  "}]
[null,null,null,{"$f":"'User Inputs_FPI_Calculator'!AF240","v":"  "},{"$f":"'User Inputs_FPI_Calculator'!AH240","v":"  "}]
[null,null,null,{"$f":"'User Inputs_FPI_Calculator'!AF241","v":"  "},{"$f":"'User Inputs_FPI_Calculator'!AH241","v":"  "}]
[null,null,null,{"$f":"'User Inputs_FPI_Calculator'!AF242","v":"  "},{"$f":"'User Inputs_FPI_Calculator'!AH242","v":"  "}]
[null,null,null,{"$f":"'User Inputs_FPI_Calculator'!AF243","v":"  "},{"$f":"'User Inputs_FPI_Calculator'!AH243","v":"  "}]
[null,null,null,{"$f":"'User Inputs_FPI_Calculator'!AF244","v":"  "},{"$f":"'User Inputs_FPI_Calculator'!AH244","v":"  "}]
[null,null,null,{"$f":"'User Inputs_FPI_Calculator'!AF245","v":"  "},{"$f":"'User Inputs_FPI_Calculator'!AH245","v":"  "}]
[null,null,null,{"$f":"'User Inputs_FPI_Calculator'!AF246","v":"  "},{"$f":"'User Inputs_FPI_Calculator'!AH246","v":"  "}]
[null,null,null,{"$f":"'User Inputs_FPI_Calculator'!AF247","v":"  "},{"$f":"'User Inputs_FPI_Calculator'!AH247","v":"  "}]
[null,null,null,{"$f":"'User Inputs_FPI_Calculator'!AF248","v":"  "},{"$f":"'User Inputs_FPI_Calculator'!AH248","v":"  "}]
[null,null,null,{"$f":"'User Inputs_FPI_Calculator'!AF249","v":"  "},{"$f":"'User Inputs_FPI_Calculator'!AH249","v":"  "}]
[null,null,null,{"$f":"'User Inputs_FPI_Calculator'!AF250","v":"  "},{"$f":"'User Inputs_FPI_Calculator'!AH250","v":"  "}]

{"sheet":"Results","index":10,"n_rows":249,"n_cols":8,"rows_kept":249,"cut":false,"hidden":true,"merged":[]}
["Fuel Type","Year"," Region 1 - Northeast "]
[{"$f":"'User Inputs_FPI_Calculator'!AF3","v":"Natural Gas"},{"$f":"'User Inputs_FPI_Calculator'!AG3","v":0},{"$f":"'User Inputs_FPI_Calculator'!AH3","v":1}]
[{"$f":"'User Inputs_FPI_Calculator'!AF4","v":"Natural Gas"},{"$f":"'User Inputs_FPI_Calculator'!AG4","v":1},{"$f":"'User Inputs_FPI_Calculator'!AH4","v":0.98644692290046421}]
[{"$f":"'User Inputs_FPI_Calculator'!AF5","v":"Natural Gas"},{"$f":"'User Inputs_FPI_Calculator'!AG5","v":2},{"$f":"'User Inputs_FPI_Calculator'!AH5","v":0.93139274010388873}]
[{"$f":"'User Inputs_FPI_Calculator'!AF6","v":"Natural Gas"},{"$f":"'User Inputs_FPI_Calculator'!AG6","v":3},{"$f":"'User Inputs_FPI_Calculator'!AH6","v":0.87012329782988573}]
[{"$f":"'User Inputs_FPI_Calculator'!AF7","v":"Natural Gas"},{"$f":"'User Inputs_FPI_Calculator'!AG7","v":4},{"$f":"'User Inputs_FPI_Calculator'!AH7","v":0.81951711053496357},null,null,null,"fuel_name","fuel_type_id"]
[{"$f":"'User Inputs_FPI_Calculator'!AF8","v":"Natural Gas"},{"$f":"'User Inputs_FPI_Calculator'!AG8","v":5},{"$f":"'User Inputs_FPI_Calculator'!AH8","v":0.7808202045643523},null,null,null,"Natural Gas",1]
[{"$f":"'User Inputs_FPI_Calculator'!AF9","v":"Natural Gas"},{"$f":"'User Inputs_FPI_Calculator'!AG9","v":6},{"$f":"'User Inputs_FPI_Calculator'!AH9","v":0.77264524240858889},null,null,null,"Oil",2]
[{"$f":"'User Inputs_FPI_Calculator'!AF10","v":"Natural Gas"},{"$f":"'User Inputs_FPI_Calculator'!AG10","v":7},{"$f":"'User Inputs_FPI_Calculator'!AH10","v":0.77671981530962486},null,null,null,"Electricity",3]
[{"$f":"'User Inputs_FPI_Calculator'!AF11","v":"Natural Gas"},{"$f":"'User Inputs_FPI_Calculator'!AG11","v":8},{"$f":"'User Inputs_FPI_Calculator'!AH11","v":0.78415816838761399},null,null,null,"Propane",4]
[{"$f":"'User Inputs_FPI_Calculator'!AF12","v":"Natural Gas"},{"$f":"'User Inputs_FPI_Calculator'!AG12","v":9},{"$f":"'User Inputs_FPI_Calculator'!AH12","v":0.79201650970829895},null,null,null,"Wood",5]
[{"$f":"'User Inputs_FPI_Calculator'!AF13","v":"Natural Gas"},{"$f":"'User Inputs_FPI_Calculator'!AG13","v":10},{"$f":"'User Inputs_FPI_Calculator'!AH13","v":0.80241362423890805},null,null,null,"Coal",6]
[{"$f":"'User Inputs_FPI_Calculator'!AF14","v":"Natural Gas"},{"$f":"'User Inputs_FPI_Calculator'!AG14","v":11},{"$f":"'User Inputs_FPI_Calculator'!AH14","v":0.81358988591630232},null,null,null,"Kerosene",7]
[{"$f":"'User Inputs_FPI_Calculator'!AF15","v":"Natural Gas"},{"$f":"'User Inputs_FPI_Calculator'!AG15","v":12},{"$f":"'User Inputs_FPI_Calculator'!AH15","v":0.82402253842054884},null,null,null,"Other",8]
[{"$f":"'User Inputs_FPI_Calculator'!AF16","v":"Natural Gas"},{"$f":"'User Inputs_FPI_Calculator'!AG16","v":13},{"$f":"'User Inputs_FPI_Calculator'!AH16","v":0.83055121890129313}]
[{"$f":"'User Inputs_FPI_Calculator'!AF17","v":"Natural Gas"},{"$f":"'User Inputs_FPI_Calculator'!AG17","v":14},{"$f":"'User Inputs_FPI_Calculator'!AH17","v":0.83997837981443046}]
[{"$f":"'User Inputs_FPI_Calculator'!AF18","v":"Natural Gas"},{"$f":"'User Inputs_FPI_Calculator'!AG18","v":15},{"$f":"'User Inputs_FPI_Calculator'!AH18","v":0.84964100190581904}]
[{"$f":"'User Inputs_FPI_Calculator'!AF19","v":"Natural Gas"},{"$f":"'User Inputs_FPI_Calculator'!AG19","v":16},{"$f":"'User Inputs_FPI_Calculator'!AH19","v":0.85317975071429641}]
[{"$f":"'User Inputs_FPI_Calculator'!AF20","v":"Natural Gas"},{"$f":"'User Inputs_FPI_Calculator'!AG20","v":17},{"$f":"'User Inputs_FPI_Calculator'!AH20","v":0.85943128439233796}]
[{"$f":"'User Inputs_FPI_Calculator'!AF21","v":"Natural Gas"},{"$f":"'User Inputs_FPI_Calculator'!AG21","v":18},{"$f":"'User Inputs_FPI_Calculator'!AH21","v":0.8672776264642148}]
[{"$f":"'User Inputs_FPI_Calculator'!AF22","v":"Natural Gas"},{"$f":"'User Inputs_FPI_Calculator'!AG22","v":19},{"$f":"'User Inputs_FPI_Calculator'!AH22","v":0.87270542680714147}]
[{"$f":"'User Inputs_FPI_Calculator'!AF23","v":"Natural Gas"},{"$f":"'User Inputs_FPI_Calculator'!AG23","v":20},{"$f":"'User Inputs_FPI_Calculator'!AH23","v":0.87547526337418469}]
[{"$f":"'User Inputs_FPI_Calculator'!AF24","v":"Natural Gas"},{"$f":"'User Inputs_FPI_Calculator'!AG24","v":21},{"$f":"'User Inputs_FPI_Calculator'!AH24","v":0.87901817156262307}]
[{"$f":"'User Inputs_FPI_Calculator'!AF25","v":"Natural Gas"},{"$f":"'User Inputs_FPI_Calculator'!AG25","v":22},{"$f":"'User Inputs_FPI_Calculator'!AH25","v":0.88505529277528905}]
[{"$f":"'User Inputs_FPI_Calculator'!AF26","v":"Natural Gas"},{"$f":"'User Inputs_FPI_Calculator'!AG26","v":23},{"$f":"'User Inputs_FPI_Calculator'!AH26","v":0.94461290563621803}]
[{"$f":"'User Inputs_FPI_Calculator'!AF27","v":"Natural Gas"},{"$f":"'User Inputs_FPI_Calculator'!AG27","v":24},{"$f":"'User Inputs_FPI_Calculator'!AH27","v":6.3462810817867572}]
[{"$f":"'User Inputs_FPI_Calculator'!AF28","v":"Natural Gas"},{"$f":"'User Inputs_FPI_Calculator'!AG28","v":25},{"$f":"'User Inputs_FPI_Calculator'!AH28","v":-4.568570649654121}]
[{"$f":"'User Inputs_FPI_Calculator'!AF29","v":"Oil"},{"$f":"'User Inputs_FPI_Calculator'!AG29","v":0},{"$f":"'User Inputs_FPI_Calculator'!AH29","v":1}]
[{"$f":"'User Inputs_FPI_Calculator'!AF30","v":"Oil"},{"$f":"'User Inputs_FPI_Calculator'!AG30","v":1},{"$f":"'User Inputs_FPI_Calculator'!AH30","v":0.96744096993821582}]
[{"$f":"'User Inputs_FPI_Calculator'!AF31","v":"Oil"},{"$f":"'User Inputs_FPI_Calculator'!AG31","v":2},{"$f":"'User Inputs_FPI_Calculator'!AH31","v":0.9296191683567282}]
[{"$f":"'User Inputs_FPI_Calculator'!AF32","v":"Oil"},{"$f":"'User Inputs_FPI_Calculator'!AG32","v":3},{"$f":"'User Inputs_FPI_Calculator'!AH32","v":0.9115323557019096}]
[{"$f":"'User Inputs_FPI_Calculator'!AF33","v":"Oil"},{"$f":"'User Inputs_FPI_Calculator'!AG33","v":4},{"$f":"'User Inputs_FPI_Calculator'!AH33","v":0.90150938135162406}]
[{"$f":"'User Inputs_FPI_Calculator'!AF34","v":"Oil"},{"$f":"'User Inputs_FPI_Calculator'!AG34","v":5},{"$f":"'User Inputs_FPI_Calculator'!AH34","v":0.89521292996080726}]
[{"$f":"'User Inputs_FPI_Calculator'!AF35","v":"Oil"},{"$f":"'User Inputs_FPI_Calculator'!AG35","v":6},{"$f":"'User Inputs_FPI_Calculator'!AH35","v":0.89651472833991153}]
[{"$f":"'User Inputs_FPI_Calculator'!AF36","v":"Oil"},{"$f":"'User Inputs_FPI_Calculator'!AG36","v":7},{"$f":"'User Inputs_FPI_Calculator'!AH36","v":0.8999237981239363}]
[{"$f":"'User Inputs_FPI_Calculator'!AF37","v":"Oil"},{"$f":"'User Inputs_FPI_Calculator'!AG37","v":8},{"$f":"'User Inputs_FPI_Calculator'!AH37","v":0.90537020148663738}]
[{"$f":"'User Inputs_FPI_Calculator'!AF38","v":"Oil"},{"$f":"'User Inputs_FPI_Calculator'!AG38","v":9},{"$f":"'User Inputs_FPI_Calculator'!AH38","v":0.91119118928362042}]
[{"$f":"'User Inputs_FPI_Calculator'!AF39","v":"Oil"},{"$f":"'User Inputs_FPI_Calculator'!AG39","v":10},{"$f":"'User Inputs_FPI_Calculator'!AH39","v":0.91542689414764422}]
[{"$f":"'User Inputs_FPI_Calculator'!AF40","v":"Oil"},{"$f":"'User Inputs_FPI_Calculator'!AG40","v":11},{"$f":"'User Inputs_FPI_Calculator'!AH40","v":0.92016740487084081}]
[{"$f":"'User Inputs_FPI_Calculator'!AF41","v":"Oil"},{"$f":"'User Inputs_FPI_Calculator'!AG41","v":12},{"$f":"'User Inputs_FPI_Calculator'!AH41","v":0.92522202548435994}]
[{"$f":"'User Inputs_FPI_Calculator'!AF42","v":"Oil"},{"$f":"'User Inputs_FPI_Calculator'!AG42","v":13},{"$f":"'User Inputs_FPI_Calculator'!AH42","v":0.92985968702895816}]
[{"$f":"'User Inputs_FPI_Calculator'!AF43","v":"Oil"},{"$f":"'User Inputs_FPI_Calculator'!AG43","v":14},{"$f":"'User Inputs_FPI_Calculator'!AH43","v":0.93689255953688566}]
[{"$f":"'User Inputs_FPI_Calculator'!AF44","v":"Oil"},{"$f":"'User Inputs_FPI_Calculator'!AG44","v":15},{"$f":"'User Inputs_FPI_Calculator'!AH44","v":0.93689255953688566}]
[{"$f":"'User Inputs_FPI_Calculator'!AF45","v":"Oil"},{"$f":"'User Inputs_FPI_Calculator'!AG45","v":16},{"$f":"'User Inputs_FPI_Calculator'!AH45","v":0.94604834920142544}]
[{"$f":"'User Inputs_FPI_Calculator'!AF46","v":"Oil"},{"$f":"'User Inputs_FPI_Calculator'!AG46","v":17},{"$f":"'User Inputs_FPI_Calculator'!AH46","v":0.95049477592143383}]
[{"$f":"'User Inputs_FPI_Calculator'!AF47","v":"Oil"},{"$f":"'User Inputs_FPI_Calculator'!AG47","v":18},{"$f":"'User Inputs_FPI_Calculator'!AH47","v":0.95674782498027733}]
[{"$f":"'User Inputs_FPI_Calculator'!AF48","v":"Oil"},{"$f":"'User Inputs_FPI_Calculator'!AG48","v":19},{"$f":"'User Inputs_FPI_Calculator'!AH48","v":0.9605850086171358}]
[{"$f":"'User Inputs_FPI_Calculator'!AF49","v":"Oil"},{"$f":"'User Inputs_FPI_Calculator'!AG49","v":20},{"$f":"'User Inputs_FPI_Calculator'!AH49","v":0.96556782188143453}]
[{"$f":"'User Inputs_FPI_Calculator'!AF50","v":"Oil"},{"$f":"'User Inputs_FPI_Calculator'!AG50","v":21},{"$f":"'User Inputs_FPI_Calculator'!AH50","v":0.96994747660376335}]
[{"$f":"'User Inputs_FPI_Calculator'!AF51","v":"Oil"},{"$f":"'User Inputs_FPI_Calculator'!AG51","v":22},{"$f":"'User Inputs_FPI_Calculator'!AH51","v":0.97396696070359146}]
[{"$f":"'User Inputs_FPI_Calculator'!AF52","v":"Oil"},{"$f":"'User Inputs_FPI_Calculator'!AG52","v":23},{"$f":"'User Inputs_FPI_Calculator'!AH52","v":0.98405895900413387}]
[{"$f":"'User Inputs_FPI_Calculator'!AF53","v":"Oil"},{"$f":"'User Inputs_FPI_Calculator'!AG53","v":24},{"$f":"'User Inputs_FPI_Calculator'!AH53","v":6.4221432294747105}]
[{"$f":"'User Inputs_FPI_Calculator'!AF54","v":"Oil"},{"$f":"'User Inputs_FPI_Calculator'!AG54","v":25},{"$f":"'User Inputs_FPI_Calculator'!AH54","v":-4.6030917570904002}]
[{"$f":"'User Inputs_FPI_Calculator'!AF55","v":"Electricity"},{"$f":"'User Inputs_FPI_Calculator'!AG55","v":0},{"$f":"'User Inputs_FPI_Calculator'!AH55","v":1}]
[{"$f":"'User Inputs_FPI_Calculator'!AF56","v":"Electricity"},{"$f":"'User Inputs_FPI_Calculator'!AG56","v":1},{"$f":"'User Inputs_FPI_Calculator'!AH56","v":0.94013512917764552}]
[{"$f":"'User Inputs_FPI_Calculator'!AF57","v":"Electricity"},{"$f":"'User Inputs_FPI_Calculator'!AG57","v":2},{"$f":"'User Inputs_FPI_Calculator'!AH57","v":0.87158944043772812}]
[{"$f":"'User Inputs_FPI_Calculator'!AF58","v":"Electricity"},{"$f":"'User Inputs_FPI_Calculator'!AG58","v":3},{"$f":"'User Inputs_FPI_Calculator'!AH58","v":0.84946776211430075}]
[{"$f":"'User Inputs_FPI_Calculator'!AF59","v":"Electricity"},{"$f":"'User Inputs_FPI_Calculator'!AG59","v":4},{"$f":"'User Inputs_FPI_Calculator'!AH59","v":0.84512530839842193}]
[{"$f":"'User Inputs_FPI_Calculator'!AF60","v":"Electricity"},{"$f":"'User Inputs_FPI_Calculator'!AG60","v":5},{"$f":"'User Inputs_FPI_Calculator'!AH60","v":0.84564516947866752}]
[{"$f":"'User Inputs_FPI_Calculator'!AF61","v":"Electricity"},{"$f":"'User Inputs_FPI_Calculator'!AG61","v":6},{"$f":"'User Inputs_FPI_Calculator'!AH61","v":0.84726671797188313}]
[{"$f":"'User Inputs_FPI_Calculator'!AF62","v":"Electricity"},{"$f":"'User Inputs_FPI_Calculator'!AG62","v":7},{"$f":"'User Inputs_FPI_Calculator'!AH62","v":0.85075500740042775}]
[{"$f":"'User Inputs_FPI_Calculator'!AF63","v":"Electricity"},{"$f":"'User Inputs_FPI_Calculator'!AG63","v":8},{"$f":"'User Inputs_FPI_Calculator'!AH63","v":0.85789638148666936}]
[{"$f":"'User Inputs_FPI_Calculator'!AF64","v":"Electricity"},{"$f":"'User Inputs_FPI_Calculator'!AG64","v":9},{"$f":"'User Inputs_FPI_Calculator'!AH64","v":0.86733719205736348}]
[{"$f":"'User Inputs_FPI_Calculator'!AF65","v":"Electricity"},{"$f":"'User Inputs_FPI_Calculator'!AG65","v":10},{"$f":"'User Inputs_FPI_Calculator'!AH65","v":0.87725271643111047}]
[{"$f":"'User Inputs_FPI_Calculator'!AF66","v":"Electricity"},{"$f":"'User Inputs_FPI_Calculator'!AG66","v":11},{"$f":"'User Inputs_FPI_Calculator'!AH66","v":0.88814230433942498}]
[{"$f":"'User Inputs_FPI_Calculator'!AF67","v":"Electricity"},{"$f":"'User Inputs_FPI_Calculator'!AG67","v":12},{"$f":"'User Inputs_FPI_Calculator'!AH67","v":0.89397286574054513}]
[{"$f":"'User Inputs_FPI_Calculator'!AF68","v":"Electricity"},{"$f":"'User Inputs_FPI_Calculator'!AG68","v":13},{"$f":"'User Inputs_FPI_Calculator'!AH68","v":0.89948570213169665}]
[{"$f":"'User Inputs_FPI_Calculator'!AF69","v":"Electricity"},{"$f":"'User Inputs_FPI_Calculator'!AG69","v":14},{"$f":"'User Inputs_FPI_Calculator'!AH69","v":0.90772953783683652}]
[{"$f":"'User Inputs_FPI_Calculator'!AF70","v":"Electricity"},{"$f":"'User Inputs_FPI_Calculator'!AG70","v":15},{"$f":"'User Inputs_FPI_Calculator'!AH70","v":0.91821658550496765}]
[{"$f":"'User Inputs_FPI_Calculator'!AF71","v":"Electricity"},{"$f":"'User Inputs_FPI_Calculator'!AG71","v":16},{"$f":"'User Inputs_FPI_Calculator'!AH71","v":0.92745230338578988}]
[{"$f":"'User Inputs_FPI_Calculator'!AF72","v":"Electricity"},{"$f":"'User Inputs_FPI_Calculator'!AG72","v":17},{"$f":"'User Inputs_FPI_Calculator'!AH72","v":0.9357518810019565}]
[{"$f":"'User Inputs_FPI_Calculator'!AF73","v":"Electricity"},{"$f":"'User Inputs_FPI_Calculator'!AG73","v":18},{"$f":"'User Inputs_FPI_Calculator'!AH73","v":0.9438556273710208}]
[{"$f":"'User Inputs_FPI_Calculator'!AF74","v":"Electricity"},{"$f":"'User Inputs_FPI_Calculator'!AG74","v":19},{"$f":"'User Inputs_FPI_Calculator'!AH74","v":0.9520221789169242}]
[{"$f":"'User Inputs_FPI_Calculator'!AF75","v":"Electricity"},{"$f":"'User Inputs_FPI_Calculator'!AG75","v":20},{"$f":"'User Inputs_FPI_Calculator'!AH75","v":0.95929276124420948}]
[{"$f":"'User Inputs_FPI_Calculator'!AF76","v":"Electricity"},{"$f":"'User Inputs_FPI_Calculator'!AG76","v":21},{"$f":"'User Inputs_FPI_Calculator'!AH76","v":0.96886906159701491}]
[{"$f":"'User Inputs_FPI_Calculator'!AF77","v":"Electricity"},{"$f":"'User Inputs_FPI_Calculator'!AG77","v":22},{"$f":"'User Inputs_FPI_Calculator'!AH77","v":0.97698611740366148}]
[{"$f":"'User Inputs_FPI_Calculator'!AF78","v":"Electricity"},{"$f":"'User Inputs_FPI_Calculator'!AG78","v":23},{"$f":"'User Inputs_FPI_Calculator'!AH78","v":0.9842581552238463}]
[{"$f":"'User Inputs_FPI_Calculator'!AF79","v":"Electricity"},{"$f":"'User Inputs_FPI_Calculator'!AG79","v":24},{"$f":"'User Inputs_FPI_Calculator'!AH79","v":6.4002935504658378}]
[{"$f":"'User Inputs_FPI_Calculator'!AF80","v":"Electricity"},{"$f":"'User Inputs_FPI_Calculator'!AG80","v":25},{"$f":"'User Inputs_FPI_Calculator'!AH80","v":-4.5818544727261985}]
[{"$f":"'User Inputs_FPI_Calculator'!AF81","v":"Propane"},{"$f":"'User Inputs_FPI_Calculator'!AG81","v":0},{"$f":"'User Inputs_FPI_Calculator'!AH81","v":1}]
[{"$f":"'User Inputs_FPI_Calculator'!AF82","v":"Propane"},{"$f":"'User Inputs_FPI_Calculator'!AG82","v":1},{"$f":"'User Inputs_FPI_Calculator'!AH82","v":1.0225543509037718}]
[{"$f":"'User Inputs_FPI_Calculator'!AF83","v":"Propane"},{"$f":"'User Inputs_FPI_Calculator'!AG83","v":2},{"$f":"'User Inputs_FPI_Calculator'!AH83","v":1.0029107349278659}]
[{"$f":"'User Inputs_FPI_Calculator'!AF84","v":"Propane"},{"$f":"'User Inputs_FPI_Calculator'!AG84","v":3},{"$f":"'User Inputs_FPI_Calculator'!AH84","v":0.97362856311983892}]
[{"$f":"'User Inputs_FPI_Calculator'!AF85","v":"Propane"},{"$f":"'User Inputs_FPI_Calculator'!AG85","v":4},{"$f":"'User Inputs_FPI_Calculator'!AH85","v":0.94877516487096869}]
[{"$f":"'User Inputs_FPI_Calculator'!AF86","v":"Propane"},{"$f":"'User Inputs_FPI_Calculator'!AG86","v":5},{"$f":"'User Inputs_FPI_Calculator'!AH86","v":0.93573302800871294}]
[{"$f":"'User Inputs_FPI_Calculator'!AF87","v":"Propane"},{"$f":"'User Inputs_FPI_Calculator'!AG87","v":6},{"$f":"'User Inputs_FPI_Calculator'!AH87","v":0.93001632971141923}]
[{"$f":"'User Inputs_FPI_Calculator'!AF88","v":"Propane"},{"$f":"'User Inputs_FPI_Calculator'!AG88","v":7},{"$f":"'User Inputs_FPI_Calculator'!AH88","v":0.93256961321707676}]
[{"$f":"'User Inputs_FPI_Calculator'!AF89","v":"Propane"},{"$f":"'User Inputs_FPI_Calculator'!AG89","v":8},{"$f":"'User Inputs_FPI_Calculator'!AH89","v":0.9413873687011719}]
[{"$f":"'User Inputs_FPI_Calculator'!AF90","v":"Propane"},{"$f":"'User Inputs_FPI_Calculator'!AG90","v":9},{"$f":"'User Inputs_FPI_Calculator'!AH90","v":0.95536981217833505}]
[{"$f":"'User Inputs_FPI_Calculator'!AF91","v":"Propane"},{"$f":"'User Inputs_FPI_Calculator'!AG91","v":10},{"$f":"'User Inputs_FPI_Calculator'!AH91","v":0.97329518985739738}]
[{"$f":"'User Inputs_FPI_Calculator'!AF92","v":"Propane"},{"$f":"'User Inputs_FPI_Calculator'!AG92","v":11},{"$f":"'User Inputs_FPI_Calculator'!AH92","v":0.99213448889661426}]
[{"$f":"'User Inputs_FPI_Calculator'!AF93","v":"Propane"},{"$f":"'User Inputs_FPI_Calculator'!AG93","v":12},{"$f":"'User Inputs_FPI_Calculator'!AH93","v":1.0084799338451442}]
[{"$f":"'User Inputs_FPI_Calculator'!AF94","v":"Propane"},{"$f":"'User Inputs_FPI_Calculator'!AG94","v":13},{"$f":"'User Inputs_FPI_Calculator'!AH94","v":1.0214584162516123}]
[{"$f":"'User Inputs_FPI_Calculator'!AF95","v":"Propane"},{"$f":"'User Inputs_FPI_Calculator'!AG95","v":14},{"$f":"'User Inputs_FPI_Calculator'!AH95","v":1.0349131728630421}]
[{"$f":"'User Inputs_FPI_Calculator'!AF96","v":"Propane"},{"$f":"'User Inputs_FPI_Calculator'!AG96","v":15},{"$f":"'User Inputs_FPI_Calculator'!AH96","v":1.0479082539146745}]
[{"$f":"'User Inputs_FPI_Calculator'!AF97","v":"Propane"},{"$f":"'User Inputs_FPI_Calculator'!AG97","v":16},{"$f":"'User Inputs_FPI_Calculator'!AH97","v":1.0571079560195109}]
[{"$f":"'User Inputs_FPI_Calculator'!AF98","v":"Propane"},{"$f":"'User Inputs_FPI_Calculator'!AG98","v":17},{"$f":"'User Inputs_FPI_Calculator'!AH98","v":1.067462819760947}]
[{"$f":"'User Inputs_FPI_Calculator'!AF99","v":"Propane"},{"$f":"'User Inputs_FPI_Calculator'!AG99","v":18},{"$f":"'User Inputs_FPI_Calculator'!AH99","v":1.0785726032827161}]
[{"$f":"'User Inputs_FPI_Calculator'!AF100","v":"Propane"},{"$f":"'User Inputs_FPI_Calculator'!AG100","v":19},{"$f":"'User Inputs_FPI_Calculator'!AH100","v":1.0876928978873526}]
[{"$f":"'User Inputs_FPI_Calculator'!AF101","v":"Propane"},{"$f":"'User Inputs_FPI_Calculator'!AG101","v":20},{"$f":"'User Inputs_FPI_Calculator'!AH101","v":1.0938155410553203}]
[{"$f":"'User Inputs_FPI_Calculator'!AF102","v":"Propane"},{"$f":"'User Inputs_FPI_Calculator'!AG102","v":21},{"$f":"'User Inputs_FPI_Calculator'!AH102","v":1.0994325757570367}]
[{"$f":"'User Inputs_FPI_Calculator'!AF103","v":"Propane"},{"$f":"'User Inputs_FPI_Calculator'!AG103","v":22},{"$f":"'User Inputs_FPI_Calculator'!AH103","v":1.1041964866176772}]
[{"$f":"'User Inputs_FPI_Calculator'!AF104","v":"Propane"},{"$f":"'User Inputs_FPI_Calculator'!AG104","v":23},{"$f":"'User Inputs_FPI_Calculator'!AH104","v":1.1307843479014483}]
[{"$f":"'User Inputs_FPI_Calculator'!AF105","v":"Propane"},{"$f":"'User Inputs_FPI_Calculator'!AG105","v":24},{"$f":"'User Inputs_FPI_Calculator'!AH105","v":7.4123542413854793}]
[{"$f":"'User Inputs_FPI_Calculator'!AF106","v":"Propane"},{"$f":"'User Inputs_FPI_Calculator'!AG106","v":25},{"$f":"'User Inputs_FPI_Calculator'!AH106","v":-5.313515908237024}]
[{"$f":"'User Inputs_FPI_Calculator'!AF107","v":"Wood"},{"$f":"'User Inputs_FPI_Calculator'!AG107","v":0},{"$f":"'User Inputs_FPI_Calculator'!AH107","v":1}]
[{"$f":"'User Inputs_FPI_Calculator'!AF108","v":"Wood"},{"$f":"'User Inputs_FPI_Calculator'!AG108","v":1},{"$f":"'User Inputs_FPI_Calculator'!AH108","v":1.0049806756849258}]
[{"$f":"'User Inputs_FPI_Calculator'!AF109","v":"Wood"},{"$f":"'User Inputs_FPI_Calculator'!AG109","v":2},{"$f":"'User Inputs_FPI_Calculator'!AH109","v":1.0099613513698513}]
[{"$f":"'User Inputs_FPI_Calculator'!AF110","v":"Wood"},{"$f":"'User Inputs_FPI_Calculator'!AG110","v":3},{"$f":"'User Inputs_FPI_Calculator'!AH110","v":1.0149420270547771}]
[{"$f":"'User Inputs_FPI_Calculator'!AF111","v":"Wood"},{"$f":"'User Inputs_FPI_Calculator'!AG111","v":4},{"$f":"'User Inputs_FPI_Calculator'!AH111","v":1.0199227027397026}]
[{"$f":"'User Inputs_FPI_Calculator'!AF112","v":"Wood"},{"$f":"'User Inputs_FPI_Calculator'!AG112","v":5},{"$f":"'User Inputs_FPI_Calculator'!AH112","v":1.0298840541095542}]
[{"$f":"'User Inputs_FPI_Calculator'!AF113","v":"Wood"},{"$f":"'User Inputs_FPI_Calculator'!AG113","v":6},{"$f":"'User Inputs_FPI_Calculator'!AH113","v":1.03486472979448}]
[{"$f":"'User Inputs_FPI_Calculator'!AF114","v":"Wood"},{"$f":"'User Inputs_FPI_Calculator'!AG114","v":7},{"$f":"'User Inputs_FPI_Calculator'!AH114","v":1.0398454054794057}]
[{"$f":"'User Inputs_FPI_Calculator'!AF115","v":"Wood"},{"$f":"'User Inputs_FPI_Calculator'!AG115","v":8},{"$f":"'User Inputs_FPI_Calculator'!AH115","v":1.0448260811643313}]
[{"$f":"'User Inputs_FPI_Calculator'!AF116","v":"Wood"},{"$f":"'User Inputs_FPI_Calculator'!AG116","v":9},{"$f":"'User Inputs_FPI_Calculator'!AH116","v":1.0498067568492571}]
[{"$f":"'User Inputs_FPI_Calculator'!AF117","v":"Wood"},{"$f":"'User Inputs_FPI_Calculator'!AG117","v":10},{"$f":"'User Inputs_FPI_Calculator'!AH117","v":1.0547874325341828}]
[{"$f":"'User Inputs_FPI_Calculator'!AF118","v":"Wood"},{"$f":"'User Inputs_FPI_Calculator'!AG118","v":11},{"$f":"'User Inputs_FPI_Calculator'!AH118","v":1.0597681082191086}]
[{"$f":"'User Inputs_FPI_Calculator'!AF119","v":"Wood"},{"$f":"'User Inputs_FPI_Calculator'!AG119","v":12},{"$f":"'User Inputs_FPI_Calculator'!AH119","v":1.0647487839040344}]
[{"$f":"'User Inputs_FPI_Calculator'!AF120","v":"Wood"},{"$f":"'User Inputs_FPI_Calculator'!AG120","v":13},{"$f":"'User Inputs_FPI_Calculator'!AH120","v":1.0697294595889599}]
[{"$f":"'User Inputs_FPI_Calculator'!AF121","v":"Wood"},{"$f":"'User Inputs_FPI_Calculator'!AG121","v":14},{"$f":"'User Inputs_FPI_Calculator'!AH121","v":1.0796908109588113}]
[{"$f":"'User Inputs_FPI_Calculator'!AF122","v":"Wood"},{"$f":"'User Inputs_FPI_Calculator'!AG122","v":15},{"$f":"'User Inputs_FPI_Calculator'!AH122","v":1.084671486643737}]
[{"$f":"'User Inputs_FPI_Calculator'!AF123","v":"Wood"},{"$f":"'User Inputs_FPI_Calculator'!AG123","v":16},{"$f":"'User Inputs_FPI_Calculator'!AH123","v":1.0896521623286628}]
[{"$f":"'User Inputs_FPI_Calculator'!AF124","v":"Wood"},{"$f":"'User Inputs_FPI_Calculator'!AG124","v":17},{"$f":"'User Inputs_FPI_Calculator'!AH124","v":1.0946328380135886}]
[{"$f":"'User Inputs_FPI_Calculator'!AF125","v":"Wood"},{"$f":"'User Inputs_FPI_Calculator'!AG125","v":18},{"$f":"'User Inputs_FPI_Calculator'!AH125","v":1.0996135136985139}]
[{"$f":"'User Inputs_FPI_Calculator'!AF126","v":"Wood"},{"$f":"'User Inputs_FPI_Calculator'!AG126","v":19},{"$f":"'User Inputs_FPI_Calculator'!AH126","v":1.1045941893834397}]
[{"$f":"'User Inputs_FPI_Calculator'!AF127","v":"Wood"},{"$f":"'User Inputs_FPI_Calculator'!AG127","v":20},{"$f":"'User Inputs_FPI_Calculator'!AH127","v":1.1095748650683654}]
[{"$f":"'User Inputs_FPI_Calculator'!AF128","v":"Wood"},{"$f":"'User Inputs_FPI_Calculator'!AG128","v":21},{"$f":"'User Inputs_FPI_Calculator'!AH128","v":1.119536216438217}]
[{"$f":"'User Inputs_FPI_Calculator'!AF129","v":"Wood"},{"$f":"'User Inputs_FPI_Calculator'!AG129","v":22},{"$f":"'User Inputs_FPI_Calculator'!AH129","v":1.1245168921231428}]
[{"$f":"'User Inputs_FPI_Calculator'!AF130","v":"Wood"},{"$f":"'User Inputs_FPI_Calculator'!AG130","v":23},{"$f":"'User Inputs_FPI_Calculator'!AH130","v":1.1294975678080683}]
[{"$f":"'User Inputs_FPI_Calculator'!AF131","v":"Wood"},{"$f":"'User Inputs_FPI_Calculator'!AG131","v":24},{"$f":"'User Inputs_FPI_Calculator'!AH131","v":7.3770856987033842}]
[{"$f":"'User Inputs_FPI_Calculator'!AF132","v":"Wood"},{"$f":"'User Inputs_FPI_Calculator'!AG132","v":25},{"$f":"'User Inputs_FPI_Calculator'!AH132","v":-5.2904267596887777}]
[{"$f":"'User Inputs_FPI_Calculator'!AF133","v":"Coal"},{"$f":"'User Inputs_FPI_Calculator'!AG133","v":0},{"$f":"'User Inputs_FPI_Calculator'!AH133","v":1}]
[{"$f":"'User Inputs_FPI_Calculator'!AF134","v":"Coal"},{"$f":"'User Inputs_FPI_Calculator'!AG134","v":1},{"$f":"'User Inputs_FPI_Calculator'!AH134","v":0.99958037539727507}]
[{"$f":"'User Inputs_FPI_Calculator'!AF135","v":"Coal"},{"$f":"'User Inputs_FPI_Calculator'!AG135","v":2},{"$f":"'User Inputs_FPI_Calculator'!AH135","v":1.0154324603239135}]
[{"$f":"'User Inputs_FPI_Calculator'!AF136","v":"Coal"},{"$f":"'User Inputs_FPI_Calculator'!AG136","v":3},{"$f":"'User Inputs_FPI_Calculator'!AH136","v":1.0230917597032092}]
[{"$f":"'User Inputs_FPI_Calculator'!AF137","v":"Coal"},{"$f":"'User Inputs_FPI_Calculator'!AG137","v":4},{"$f":"'User Inputs_FPI_Calculator'!AH137","v":1.0199693294193084}]
[{"$f":"'User Inputs_FPI_Calculator'!AF138","v":"Coal"},{"$f":"'User Inputs_FPI_Calculator'!AG138","v":5},{"$f":"'User Inputs_FPI_Calculator'!AH138","v":1.0125766577111781}]
[{"$f":"'User Inputs_FPI_Calculator'!AF139","v":"Coal"},{"$f":"'User Inputs_FPI_Calculator'!AG139","v":6},{"$f":"'User Inputs_FPI_Calculator'!AH139","v":1.0072756330471637}]
[{"$f":"'User Inputs_FPI_Calculator'!AF140","v":"Coal"},{"$f":"'User Inputs_FPI_Calculator'!AG140","v":7},{"$f":"'User Inputs_FPI_Calculator'!AH140","v":1.0031508877058128}]
[{"$f":"'User Inputs_FPI_Calculator'!AF141","v":"Coal"},{"$f":"'User Inputs_FPI_Calculator'!AG141","v":8},{"$f":"'User Inputs_FPI_Calculator'!AH141","v":0.998864722589065}]
[{"$f":"'User Inputs_FPI_Calculator'!AF142","v":"Coal"},{"$f":"'User Inputs_FPI_Calculator'!AG142","v":9},{"$f":"'User Inputs_FPI_Calculator'!AH142","v":0.99395382073894578}]
[{"$f":"'User Inputs_FPI_Calculator'!AF143","v":"Coal"},{"$f":"'User Inputs_FPI_Calculator'!AG143","v":10},{"$f":"'User Inputs_FPI_Calculator'!AH143","v":0.98999259627037806}]
[{"$f":"'User Inputs_FPI_Calculator'!AF144","v":"Coal"},{"$f":"'User Inputs_FPI_Calculator'!AG144","v":11},{"$f":"'User Inputs_FPI_Calculator'!AH144","v":0.98754377488635114}]
[{"$f":"'User Inputs_FPI_Calculator'!AF145","v":"Coal"},{"$f":"'User Inputs_FPI_Calculator'!AG145","v":12},{"$f":"'User Inputs_FPI_Calculator'!AH145","v":0.98550263565661234}]
[{"$f":"'User Inputs_FPI_Calculator'!AF146","v":"Coal"},{"$f":"'User Inputs_FPI_Calculator'!AG146","v":13},{"$f":"'User Inputs_FPI_Calculator'!AH146","v":0.983826355068257}]
[{"$f":"'User Inputs_FPI_Calculator'!AF147","v":"Coal"},{"$f":"'User Inputs_FPI_Calculator'!AG147","v":14},{"$f":"'User Inputs_FPI_Calculator'!AH147","v":0.98293976559455631}]
[{"$f":"'User Inputs_FPI_Calculator'!AF148","v":"Coal"},{"$f":"'User Inputs_FPI_Calculator'!AG148","v":15},{"$f":"'User Inputs_FPI_Calculator'!AH148","v":0.98280573923407222}]
[{"$f":"'User Inputs_FPI_Calculator'!AF149","v":"Coal"},{"$f":"'User Inputs_FPI_Calculator'!AG149","v":16},{"$f":"'User Inputs_FPI_Calculator'!AH149","v":0.98242345287969679}]
[{"$f":"'User Inputs_FPI_Calculator'!AF150","v":"Coal"},{"$f":"'User Inputs_FPI_Calculator'!AG150","v":17},{"$f":"'User Inputs_FPI_Calculator'!AH150","v":0.98069830369882582}]
[{"$f":"'User Inputs_FPI_Calculator'!AF151","v":"Coal"},{"$f":"'User Inputs_FPI_Calculator'!AG151","v":18},{"$f":"'User Inputs_FPI_Calculator'!AH151","v":0.97898990127258756}]
[{"$f":"'User Inputs_FPI_Calculator'!AF152","v":"Coal"},{"$f":"'User Inputs_FPI_Calculator'!AG152","v":19},{"$f":"'User Inputs_FPI_Calculator'!AH152","v":0.97734247820694897}]
[{"$f":"'User Inputs_FPI_Calculator'!AF153","v":"Coal"},{"$f":"'User Inputs_FPI_Calculator'!AG153","v":20},{"$f":"'User Inputs_FPI_Calculator'!AH153","v":0.97725979661604012}]
[{"$f":"'User Inputs_FPI_Calculator'!AF154","v":"Coal"},{"$f":"'User Inputs_FPI_Calculator'!AG154","v":21},{"$f":"'User Inputs_FPI_Calculator'!AH154","v":0.97796753592336461}]
[{"$f":"'User Inputs_FPI_Calculator'!AF155","v":"Coal"},{"$f":"'User Inputs_FPI_Calculator'!AG155","v":22},{"$f":"'User Inputs_FPI_Calculator'!AH155","v":0.97985988033346649}]
[{"$f":"'User Inputs_FPI_Calculator'!AF156","v":"Coal"},{"$f":"'User Inputs_FPI_Calculator'!AG156","v":23},{"$f":"'User Inputs_FPI_Calculator'!AH156","v":0.9801098274443335}]
[{"$f":"'User Inputs_FPI_Calculator'!AF157","v":"Coal"},{"$f":"'User Inputs_FPI_Calculator'!AG157","v":24},{"$f":"'User Inputs_FPI_Calculator'!AH157","v":6.2986048529765206}]
[{"$f":"'User Inputs_FPI_Calculator'!AF158","v":"Coal"},{"$f":"'User Inputs_FPI_Calculator'!AG158","v":25},{"$f":"'User Inputs_FPI_Calculator'!AH158","v":-4.4961003834566755}]
[{"$f":"'User Inputs_FPI_Calculator'!AF159","v":"Kerosene"},{"$f":"'User Inputs_FPI_Calculator'!AG159","v":0},{"$f":"'User Inputs_FPI_Calculator'!AH159","v":1}]
[{"$f":"'User Inputs_FPI_Calculator'!AF160","v":"Kerosene"},{"$f":"'User Inputs_FPI_Calculator'!AG160","v":1},{"$f":"'User Inputs_FPI_Calculator'!AH160","v":0.96771386467472953}]
[{"$f":"'User Inputs_FPI_Calculator'!AF161","v":"Kerosene"},{"$f":"'User Inputs_FPI_Calculator'!AG161","v":2},{"$f":"'User Inputs_FPI_Calculator'!AH161","v":0.93019288448142434}]
[{"$f":"'User Inputs_FPI_Calculator'!AF162","v":"Kerosene"},{"$f":"'User Inputs_FPI_Calculator'!AG162","v":3},{"$f":"'User Inputs_FPI_Calculator'!AH162","v":0.91230217041628336}]
[{"$f":"'User Inputs_FPI_Calculator'!AF163","v":"Kerosene"},{"$f":"'User Inputs_FPI_Calculator'!AG163","v":4},{"$f":"'User Inputs_FPI_Calculator'!AH163","v":0.9024325042737259}]
[{"$f":"'User Inputs_FPI_Calculator'!AF164","v":"Kerosene"},{"$f":"'User Inputs_FPI_Calculator'!AG164","v":5},{"$f":"'User Inputs_FPI_Calculator'!AH164","v":0.89636970823202466}]
[{"$f":"'User Inputs_FPI_Calculator'!AF165","v":"Kerosene"},{"$f":"'User Inputs_FPI_Calculator'!AG165","v":6},{"$f":"'User Inputs_FPI_Calculator'!AH165","v":0.8977647204404382}]
[{"$f":"'User Inputs_FPI_Calculator'!AF166","v":"Kerosene"},{"$f":"'User Inputs_FPI_Calculator'!AG166","v":7},{"$f":"'User Inputs_FPI_Calculator'!AH166","v":0.90125582191632325}]
[{"$f":"'User Inputs_FPI_Calculator'!AF167","v":"Kerosene"},{"$f":"'User Inputs_FPI_Calculator'!AG167","v":8},{"$f":"'User Inputs_FPI_Calculator'!AH167","v":0.90677344595524934}]
[{"$f":"'User Inputs_FPI_Calculator'!AF168","v":"Kerosene"},{"$f":"'User Inputs_FPI_Calculator'!AG168","v":9},{"$f":"'User Inputs_FPI_Calculator'!AH168","v":0.91266366671362364}]
[{"$f":"'User Inputs_FPI_Calculator'!AF169","v":"Kerosene"},{"$f":"'User Inputs_FPI_Calculator'!AG169","v":10},{"$f":"'User Inputs_FPI_Calculator'!AH169","v":0.91697701676900156}]
[{"$f":"'User Inputs_FPI_Calculator'!AF170","v":"Kerosene"},{"$f":"'User Inputs_FPI_Calculator'!AG170","v":11},{"$f":"'User Inputs_FPI_Calculator'!AH170","v":0.92179249395479912}]
[{"$f":"'User Inputs_FPI_Calculator'!AF171","v":"Kerosene"},{"$f":"'User Inputs_FPI_Calculator'!AG171","v":12},{"$f":"'User Inputs_FPI_Calculator'!AH171","v":0.92692041422143312}]
[{"$f":"'User Inputs_FPI_Calculator'!AF172","v":"Kerosene"},{"$f":"'User Inputs_FPI_Calculator'!AG172","v":13},{"$f":"'User Inputs_FPI_Calculator'!AH172","v":0.931633587993003}]
[{"$f":"'User Inputs_FPI_Calculator'!AF173","v":"Kerosene"},{"$f":"'User Inputs_FPI_Calculator'!AG173","v":14},{"$f":"'User Inputs_FPI_Calculator'!AH173","v":0.93882938441431851}]
[{"$f":"'User Inputs_FPI_Calculator'!AF174","v":"Kerosene"},{"$f":"'User Inputs_FPI_Calculator'!AG174","v":15},{"$f":"'User Inputs_FPI_Calculator'!AH174","v":0.94377250730470608}]
[{"$f":"'User Inputs_FPI_Calculator'!AF175","v":"Kerosene"},{"$f":"'User Inputs_FPI_Calculator'!AG175","v":16},{"$f":"'User Inputs_FPI_Calculator'!AH175","v":0.94813683283134542}]
[{"$f":"'User Inputs_FPI_Calculator'!AF176","v":"Kerosene"},{"$f":"'User Inputs_FPI_Calculator'!AG176","v":17},{"$f":"'User Inputs_FPI_Calculator'!AH176","v":0.95265978655700501}]
[{"$f":"'User Inputs_FPI_Calculator'!AF177","v":"Kerosene"},{"$f":"'User Inputs_FPI_Calculator'!AG177","v":18},{"$f":"'User Inputs_FPI_Calculator'!AH177","v":0.95897977586430039}]
[{"$f":"'User Inputs_FPI_Calculator'!AF178","v":"Kerosene"},{"$f":"'User Inputs_FPI_Calculator'!AG178","v":19},{"$f":"'User Inputs_FPI_Calculator'!AH178","v":0.96289671942682198}]
[{"$f":"'User Inputs_FPI_Calculator'!AF179","v":"Kerosene"},{"$f":"'User Inputs_FPI_Calculator'!AG179","v":20},{"$f":"'User Inputs_FPI_Calculator'!AH179","v":0.96795321338658591}]
[{"$f":"'User Inputs_FPI_Calculator'!AF180","v":"Kerosene"},{"$f":"'User Inputs_FPI_Calculator'!AG180","v":21},{"$f":"'User Inputs_FPI_Calculator'!AH180","v":0.97250987119876353}]
[{"$f":"'User Inputs_FPI_Calculator'!AF181","v":"Kerosene"},{"$f":"'User Inputs_FPI_Calculator'!AG181","v":22},{"$f":"'User Inputs_FPI_Calculator'!AH181","v":0.97660814785534833}]
[{"$f":"'User Inputs_FPI_Calculator'!AF182","v":"Kerosene"},{"$f":"'User Inputs_FPI_Calculator'!AG182","v":23},{"$f":"'User Inputs_FPI_Calculator'!AH182","v":0.98674671519920054}]
[{"$f":"'User Inputs_FPI_Calculator'!AF183","v":"Kerosene"},{"$f":"'User Inputs_FPI_Calculator'!AG183","v":24},{"$f":"'User Inputs_FPI_Calculator'!AH183","v":6.4414127895891449}]
[{"$f":"'User Inputs_FPI_Calculator'!AF184","v":"Kerosene"},{"$f":"'User Inputs_FPI_Calculator'!AG184","v":25},{"$f":"'User Inputs_FPI_Calculator'!AH184","v":-4.6172545840696948}]
[{"$f":"'User Inputs_FPI_Calculator'!AF185","v":"Other"},{"$f":"'User Inputs_FPI_Calculator'!AG185","v":0},{"$f":"'User Inputs_FPI_Calculator'!AH185","v":1}]
[{"$f":"'User Inputs_FPI_Calculator'!AF186","v":"Other"},{"$f":"'User Inputs_FPI_Calculator'!AG186","v":1},{"$f":"'User Inputs_FPI_Calculator'!AH186","v":1}]
[{"$f":"'User Inputs_FPI_Calculator'!AF187","v":"Other"},{"$f":"'User Inputs_FPI_Calculator'!AG187","v":2},{"$f":"'User Inputs_FPI_Calculator'!AH187","v":1}]
[{"$f":"'User Inputs_FPI_Calculator'!AF188","v":"Other"},{"$f":"'User Inputs_FPI_Calculator'!AG188","v":3},{"$f":"'User Inputs_FPI_Calculator'!AH188","v":1}]
[{"$f":"'User Inputs_FPI_Calculator'!AF189","v":"Other"},{"$f":"'User Inputs_FPI_Calculator'!AG189","v":4},{"$f":"'User Inputs_FPI_Calculator'!AH189","v":1}]
[{"$f":"'User Inputs_FPI_Calculator'!AF190","v":"Other"},{"$f":"'User Inputs_FPI_Calculator'!AG190","v":5},{"$f":"'User Inputs_FPI_Calculator'!AH190","v":1}]
[{"$f":"'User Inputs_FPI_Calculator'!AF191","v":"Other"},{"$f":"'User Inputs_FPI_Calculator'!AG191","v":6},{"$f":"'User Inputs_FPI_Calculator'!AH191","v":1}]
[{"$f":"'User Inputs_FPI_Calculator'!AF192","v":"Other"},{"$f":"'User Inputs_FPI_Calculator'!AG192","v":7},{"$f":"'User Inputs_FPI_Calculator'!AH192","v":1}]
[{"$f":"'User Inputs_FPI_Calculator'!AF193","v":"Other"},{"$f":"'User Inputs_FPI_Calculator'!AG193","v":8},{"$f":"'User Inputs_FPI_Calculator'!AH193","v":1}]
[{"$f":"'User Inputs_FPI_Calculator'!AF194","v":"Other"},{"$f":"'User Inputs_FPI_Calculator'!AG194","v":9},{"$f":"'User Inputs_FPI_Calculator'!AH194","v":1}]
[{"$f":"'User Inputs_FPI_Calculator'!AF195","v":"Other"},{"$f":"'User Inputs_FPI_Calculator'!AG195","v":10},{"$f":"'User Inputs_FPI_Calculator'!AH195","v":1}]
[{"$f":"'User Inputs_FPI_Calculator'!AF196","v":"Other"},{"$f":"'User Inputs_FPI_Calculator'!AG196","v":11},{"$f":"'User Inputs_FPI_Calculator'!AH196","v":1}]
[{"$f":"'User Inputs_FPI_Calculator'!AF197","v":"Other"},{"$f":"'User Inputs_FPI_Calculator'!AG197","v":12},{"$f":"'User Inputs_FPI_Calculator'!AH197","v":1}]
[{"$f":"'User Inputs_FPI_Calculator'!AF198","v":"Other"},{"$f":"'User Inputs_FPI_Calculator'!AG198","v":13},{"$f":"'User Inputs_FPI_Calculator'!AH198","v":1}]
[{"$f":"'User Inputs_FPI_Calculator'!AF199","v":"Other"},{"$f":"'User Inputs_FPI_Calculator'!AG199","v":14},{"$f":"'User Inputs_FPI_Calculator'!AH199","v":1}]
[{"$f":"'User Inputs_FPI_Calculator'!AF200","v":"Other"},{"$f":"'User Inputs_FPI_Calculator'!AG200","v":15},{"$f":"'User Inputs_FPI_Calculator'!AH200","v":1}]
[{"$f":"'User Inputs_FPI_Calculator'!AF201","v":"Other"},{"$f":"'User Inputs_FPI_Calculator'!AG201","v":16},{"$f":"'User Inputs_FPI_Calculator'!AH201","v":1}]
[{"$f":"'User Inputs_FPI_Calculator'!AF202","v":"Other"},{"$f":"'User Inputs_FPI_Calculator'!AG202","v":17},{"$f":"'User Inputs_FPI_Calculator'!AH202","v":1}]
[{"$f":"'User Inputs_FPI_Calculator'!AF203","v":"Other"},{"$f":"'User Inputs_FPI_Calculator'!AG203","v":18},{"$f":"'User Inputs_FPI_Calculator'!AH203","v":1}]
[{"$f":"'User Inputs_FPI_Calculator'!AF204","v":"Other"},{"$f":"'User Inputs_FPI_Calculator'!AG204","v":19},{"$f":"'User Inputs_FPI_Calculator'!AH204","v":1}]
[{"$f":"'User Inputs_FPI_Calculator'!AF205","v":"Other"},{"$f":"'User Inputs_FPI_Calculator'!AG205","v":20},{"$f":"'User Inputs_FPI_Calculator'!AH205","v":1}]
[{"$f":"'User Inputs_FPI_Calculator'!AF206","v":"Other"},{"$f":"'User Inputs_FPI_Calculator'!AG206","v":21},{"$f":"'User Inputs_FPI_Calculator'!AH206","v":1}]
[{"$f":"'User Inputs_FPI_Calculator'!AF207","v":"Other"},{"$f":"'User Inputs_FPI_Calculator'!AG207","v":22},{"$f":"'User Inputs_FPI_Calculator'!AH207","v":1}]
[{"$f":"'User Inputs_FPI_Calculator'!AF208","v":"Other"},{"$f":"'User Inputs_FPI_Calculator'!AG208","v":23},{"$f":"'User Inputs_FPI_Calculator'!AH208","v":1}]
[{"$f":"'User Inputs_FPI_Calculator'!AF209","v":"Other"},{"$f":"'User Inputs_FPI_Calculator'!AG209","v":24},{"$f":"'User Inputs_FPI_Calculator'!AH209","v":6.4171914438781892}]
[{"$f":"'User Inputs_FPI_Calculator'!AF210","v":"Other"},{"$f":"'User Inputs_FPI_Calculator'!AG210","v":25},{"$f":"'User Inputs_FPI_Calculator'!AH210","v":-4.5797071871945407}]
[{"$f":"'User Inputs_FPI_Calculator'!AF211","v":"  "},{"$f":"'User Inputs_FPI_Calculator'!AG211","v":"  "},{"$f":"'User Inputs_FPI_Calculator'!AH211","v":"  "}]
[{"$f":"'User Inputs_FPI_Calculator'!AF212","v":"  "},{"$f":"'User Inputs_FPI_Calculator'!AG212","v":"  "},{"$f":"'User Inputs_FPI_Calculator'!AH212","v":"  "}]
[{"$f":"'User Inputs_FPI_Calculator'!AF213","v":"  "},{"$f":"'User Inputs_FPI_Calculator'!AG213","v":"  "},{"$f":"'User Inputs_FPI_Calculator'!AH213","v":"  "}]
[{"$f":"'User Inputs_FPI_Calculator'!AF214","v":"  "},{"$f":"'User Inputs_FPI_Calculator'!AG214","v":"  "},{"$f":"'User Inputs_FPI_Calculator'!AH214","v":"  "}]
[{"$f":"'User Inputs_FPI_Calculator'!AF215","v":"  "},{"$f":"'User Inputs_FPI_Calculator'!AG215","v":"  "},{"$f":"'User Inputs_FPI_Calculator'!AH215","v":"  "}]
[{"$f":"'User Inputs_FPI_Calculator'!AF216","v":"  "},{"$f":"'User Inputs_FPI_Calculator'!AG216","v":"  "},{"$f":"'User Inputs_FPI_Calculator'!AH216","v":"  "}]
[{"$f":"'User Inputs_FPI_Calculator'!AF217","v":"  "},{"$f":"'User Inputs_FPI_Calculator'!AG217","v":"  "},{"$f":"'User Inputs_FPI_Calculator'!AH217","v":"  "}]
[{"$f":"'User Inputs_FPI_Calculator'!AF218","v":"  "},{"$f":"'User Inputs_FPI_Calculator'!AG218","v":"  "},{"$f":"'User Inputs_FPI_Calculator'!AH218","v":"  "}]
[{"$f":"'User Inputs_FPI_Calculator'!AF219","v":"  "},{"$f":"'User Inputs_FPI_Calculator'!AG219","v":"  "},{"$f":"'User Inputs_FPI_Calculator'!AH219","v":"  "}]
[{"$f":"'User Inputs_FPI_Calculator'!AF220","v":"  "},{"$f":"'User Inputs_FPI_Calculator'!AG220","v":"  "},{"$f":"'User Inputs_FPI_Calculator'!AH220","v":"  "}]
[{"$f":"'User Inputs_FPI_Calculator'!AF221","v":"  "},{"$f":"'User Inputs_FPI_Calculator'!AG221","v":"  "},{"$f":"'User Inputs_FPI_Calculator'!AH221","v":"  "}]
[{"$f":"'User Inputs_FPI_Calculator'!AF222","v":"  "},{"$f":"'User Inputs_FPI_Calculator'!AG222","v":"  "},{"$f":"'User Inputs_FPI_Calculator'!AH222","v":"  "}]
[{"$f":"'User Inputs_FPI_Calculator'!AF223","v":"  "},{"$f":"'User Inputs_FPI_Calculator'!AG223","v":"  "},{"$f":"'User Inputs_FPI_Calculator'!AH223","v":"  "}]
[{"$f":"'User Inputs_FPI_Calculator'!AF224","v":"  "},{"$f":"'User Inputs_FPI_Calculator'!AG224","v":"  "},{"$f":"'User Inputs_FPI_Calculator'!AH224","v":"  "}]
[{"$f":"'User Inputs_FPI_Calculator'!AF225","v":"  "},{"$f":"'User Inputs_FPI_Calculator'!AG225","v":"  "},{"$f":"'User Inputs_FPI_Calculator'!AH225","v":"  "}]
[{"$f":"'User Inputs_FPI_Calculator'!AF226","v":"  "},{"$f":"'User Inputs_FPI_Calculator'!AG226","v":"  "},{"$f":"'User Inputs_FPI_Calculator'!AH226","v":"  "}]
[{"$f":"'User Inputs_FPI_Calculator'!AF227","v":"  "},{"$f":"'User Inputs_FPI_Calculator'!AG227","v":"  "},{"$f":"'User Inputs_FPI_Calculator'!AH227","v":"  "}]
[{"$f":"'User Inputs_FPI_Calculator'!AF228","v":"  "},{"$f":"'User Inputs_FPI_Calculator'!AG228","v":"  "},{"$f":"'User Inputs_FPI_Calculator'!AH228","v":"  "}]
[{"$f":"'User Inputs_FPI_Calculator'!AF229","v":"  "},{"$f":"'User Inputs_FPI_Calculator'!AG229","v":"  "},{"$f":"'User Inputs_FPI_Calculator'!AH229","v":"  "}]
[{"$f":"'User Inputs_FPI_Calculator'!AF230","v":"  "},{"$f":"'User Inputs_FPI_Calculator'!AG230","v":"  "},{"$f":"'User Inputs_FPI_Calculator'!AH230","v":"  "}]
[{"$f":"'User Inputs_FPI_Calculator'!AF231","v":"  "},{"$f":"'User Inputs_FPI_Calculator'!AG231","v":"  "},{"$f":"'User Inputs_FPI_Calculator'!AH231","v":"  "}]
[{"$f":"'User Inputs_FPI_Calculator'!AF232","v":"  "},{"$f":"'User Inputs_FPI_Calculator'!AG232","v":"  "},{"$f":"'User Inputs_FPI_Calculator'!AH232","v":"  "}]
[{"$f":"'User Inputs_FPI_Calculator'!AF233","v":"  "},{"$f":"'User Inputs_FPI_Calculator'!AG233","v":"  "},{"$f":"'User Inputs_FPI_Calculator'!AH233","v":"  "}]
[{"$f":"'User Inputs_FPI_Calculator'!AF234","v":"  "},{"$f":"'User Inputs_FPI_Calculator'!AG234","v":"  "},{"$f":"'User Inputs_FPI_Calculator'!AH234","v":"  "}]
[{"$f":"'User Inputs_FPI_Calculator'!AF235","v":"  "},{"$f":"'User Inputs_FPI_Calculator'!AG235","v":"  "},{"$f":"'User Inputs_FPI_Calculator'!AH235","v":"  "}]
[{"$f":"'User Inputs_FPI_Calculator'!AF236","v":"  "},{"$f":"'User Inputs_FPI_Calculator'!AG236","v":"  "},{"$f":"'User Inputs_FPI_Calculator'!AH236","v":"  "}]
[{"$f":"'User Inputs_FPI_Calculator'!AF237","v":"  "},{"$f":"'User Inputs_FPI_Calculator'!AG237","v":"  "},{"$f":"'User Inputs_FPI_Calculator'!AH237","v":"  "}]
[{"$f":"'User Inputs_FPI_Calculator'!AF238","v":"  "},{"$f":"'User Inputs_FPI_Calculator'!AG238","v":"  "},{"$f":"'User Inputs_FPI_Calculator'!AH238","v":"  "}]
[{"$f":"'User Inputs_FPI_Calculator'!AF239","v":"  "},{"$f":"'User Inputs_FPI_Calculator'!AG239","v":"  "},{"$f":"'User Inputs_FPI_Calculator'!AH239","v":"  "}]
[{"$f":"'User Inputs_FPI_Calculator'!AF240","v":"  "},{"$f":"'User Inputs_FPI_Calculator'!AG240","v":"  "},{"$f":"'User Inputs_FPI_Calculator'!AH240","v":"  "}]
[{"$f":"'User Inputs_FPI_Calculator'!AF241","v":"  "},{"$f":"'User Inputs_FPI_Calculator'!AG241","v":"  "},{"$f":"'User Inputs_FPI_Calculator'!AH241","v":"  "}]
[{"$f":"'User Inputs_FPI_Calculator'!AF242","v":"  "},{"$f":"'User Inputs_FPI_Calculator'!AG242","v":"  "},{"$f":"'User Inputs_FPI_Calculator'!AH242","v":"  "}]
[{"$f":"'User Inputs_FPI_Calculator'!AF243","v":"  "},{"$f":"'User Inputs_FPI_Calculator'!AG243","v":"  "},{"$f":"'User Inputs_FPI_Calculator'!AH243","v":"  "}]
[{"$f":"'User Inputs_FPI_Calculator'!AF244","v":"  "},{"$f":"'User Inputs_FPI_Calculator'!AG244","v":"  "},{"$f":"'User Inputs_FPI_Calculator'!AH244","v":"  "}]
[{"$f":"'User Inputs_FPI_Calculator'!AF245","v":"  "},{"$f":"'User Inputs_FPI_Calculator'!AG245","v":"  "},{"$f":"'User Inputs_FPI_Calculator'!AH245","v":"  "}]
[{"$f":"'User Inputs_FPI_Calculator'!AF246","v":"  "},{"$f":"'User Inputs_FPI_Calculator'!AG246","v":"  "},{"$f":"'User Inputs_FPI_Calculator'!AH246","v":"  "}]
[{"$f":"'User Inputs_FPI_Calculator'!AF247","v":"  "},{"$f":"'User Inputs_FPI_Calculator'!AG247","v":"  "},{"$f":"'User Inputs_FPI_Calculator'!AH247","v":"  "}]
[{"$f":"'User Inputs_FPI_Calculator'!AF248","v":"  "},{"$f":"'User Inputs_FPI_Calculator'!AG248","v":"  "},{"$f":"'User Inputs_FPI_Calculator'!AH248","v":"  "}]
[{"$f":"'User Inputs_FPI_Calculator'!AF249","v":"  "},{"$f":"'User Inputs_FPI_Calculator'!AG249","v":"  "},{"$f":"'User Inputs_FPI_Calculator'!AH249","v":"  "}]
[{"$f":"'User Inputs_FPI_Calculator'!AF250","v":"  "},{"$f":"'User Inputs_FPI_Calculator'!AG250","v":"  "},{"$f":"'User Inputs_FPI_Calculator'!AH250","v":"  "}]

{"sheet":"Sheet1","index":11,"n_rows":103,"n_cols":16,"rows_kept":103,"cut":false,"hidden":true,"merged":[]}
["Sub json111()",null,null,null,null,null,null,"Sub json111()",null,null,null,null,null,null,null,"Sub json111()"]
[]
["Set wb = ActiveWorkbook",null,null,null,null,null,null,"Set wb = ActiveWorkbook",null,null,null,null,null,null,null,"Set wb = ActiveWorkbook"]
["Set wi = wb.Sheets(\"Results_convert_json\")",null,null,null,null,null,null,"Set wi = wb.Sheets(\"Results_convert_json\")",null,null,null,null,null,null,null,"Set wi = wb.Sheets(\"Results_convert_json\")"]
["lrow = wi.Cells(wi.Rows.Count, 6).End(xlUp).Row",null,null,null,null,null,null,"lrow = wi.Cells(wi.Rows.Count, 6).End(xlUp).Row",null,null,null,null,null,null,null,"lrow = wi.Cells(wi.Rows.Count, 6).End(xlUp).Row"]
["Dim headerRange As Range: Set headerRange = wi.Range(\"A1:Z1\")",null,null,null,null,null,null,"Dim headerRange As Range: Set headerRange = wi.Range(\"A1:Z1\")",null,null,null,null,null,null,null,"Dim headerRange As Range: Set headerRange = wi.Range(\"A1:Z1\")"]
["Dim JSON As String: JSON = \"{\"",null,null,null,null,null,null,"Dim JSON As String: JSON = \"{\"",null,null,null,null,null,null,null,"Dim JSON As String: JSON = \"{\""]
["Dim jsonData As String: jsonData = \"{\"",null,null,null,null,null,null,"Dim jsonData As String: jsonData = \"{\"",null,null,null,null,null,null,null,"Dim jsonData As String: jsonData = \"{\""]
["basey = \"\"",null,null,null,null,null,null,"basey = \"\"",null,null,null,null,null,null,null,"basey = \"\""]
["census = \"\"",null,null,null,null,null,null,"census = \"\"",null,null,null,null,null,null,null,"census = \"\""]
["fuelt = \"\"",null,null,null,null,null,null,"fuelt = \"\"",null,null,null,null,null,null,null,"fuelt = \"\""]
["fueltid = \"\"",null,null,null,null,null,null,"fueltid = \"\"",null,null,null,null,null,null,null,"fueltid = \"\""]
[]
["'Dim FldrPicker As FileDialog",null,null,null,null,null,null,"'Dim FldrPicker As FileDialog",null,null,null,null,null,null,null,"'Dim FldrPicker As FileDialog"]
["'Dim myFolder As String",null,null,null,null,null,null,"'Dim myFolder As String",null,null,null,null,null,null,null,"'Dim myFolder As String"]
["''Have User Select Folder to Save to with Dialog Box",null,null,null,null,null,null,"''Have User Select Folder to Save to with Dialog Box",null,null,null,null,null,null,null,"''Have User Select Folder to Save to with Dialog Box"]
["'  Set FldrPicker = Application.FileDialog(msoFileDialogFolderPicker)",null,null,null,null,null,null,"'  Set FldrPicker = Application.FileDialog(msoFileDialogFolderPicker)",null,null,null,null,null,null,null,"'  Set FldrPicker = Application.FileDialog(msoFileDialogFolderPicker)"]
["'  With FldrPicker",null,null,null,null,null,null,"'  With FldrPicker",null,null,null,null,null,null,null,"'  With FldrPicker"]
["'    .Title = \"Select A Target Folder\"",null,null,null,null,null,null,"'    .Title = \"Select A Target Folder\"",null,null,null,null,null,null,null,"'    .Title = \"Select A Target Folder\""]
["'    .AllowMultiSelect = False",null,null,null,null,null,null,"'    .AllowMultiSelect = False",null,null,null,null,null,null,null,"'    .AllowMultiSelect = False"]
["'    If .Show <> -1 Then Exit Sub 'Check if user clicked cancel button",null,null,null,null,null,null,"'    If .Show <> -1 Then Exit Sub 'Check if user clicked cancel button",null,null,null,null,null,null,null,"'    If .Show <> -1 Then Exit Sub 'Check if user clicked cancel button"]
["'    myFolder = .SelectedItems(1) & \"\\\"",null,null,null,null,null,null,"'    myFolder = .SelectedItems(1) & \"\\\"",null,null,null,null,null,null,null,"'    myFolder = .SelectedItems(1) & \"\\\""]
["'  End With",null,null,null,null,null,null,"'  End With",null,null,null,null,null,null,null,"'  End With"]
[]
["Dim myFile As Variant",null,null,null,null,null,null,"Dim myFile As Variant",null,null,null,null,null,null,null,"Dim myFile As Variant"]
[" ",null,null,null,null,null,null," ",null,null,null,null,null,null,null," "]
["myFile = Application.GetSaveAsFilename _",null,null,null,null,null,null,"myFile = Application.GetSaveAsFilename _",null,null,null,null,null,null,null,"myFile = Application.GetSaveAsFilename _"]
["    (InitialFileName:=\"output.JSON\", _",null,null,null,null,null,null,"    (InitialFileName:=\"output.JSON\", _",null,null,null,null,null,null,null,"    (InitialFileName:=\"output.JSON\", _"]
["        Title:=\"Select Folder and FileName to save\")",null,null,null,null,null,null,"        Title:=\"Select Folder and FileName to save\")",null,null,null,null,null,null,null,"        Title:=\"Select Folder and FileName to save\")"]
["  ",null,null,null,null,null,null,null,null,null,null,null,null,null,null," If Right(myFile, 1) = \".\" Then"]
[" If Right(myFile, 1) = \".\" Then",null,null,null,null,null,null," If Right(myFile, 1) = \".\" Then",null,null,null,null,null,null,null,"    filename1 = myFile & \"json\""]
["    filename1 = myFile & \"json\"",null,null,null,null,null,null,"    filename1 = myFile & \"json\"",null,null,null,null,null,null,null," ElseIf Right(myFile, 5) = \".json\" Then"]
[" ElseIf Right(myFile, 5) = \".json\" Then",null,null,null,null,null,null," ElseIf Right(myFile, 5) = \".json\" Then",null,null,null,null,null,null,null,"    filename1 = myFile"]
["    filename1 = myFile",null,null,null,null,null,null,"    filename1 = myFile",null,null,null,null,null,null,null," Else"]
[" Else",null,null,null,null,null,null," Else",null,null,null,null,null,null,null,"    filename1 = myFile & \".json\""]
["    filename1 = myFile & \".json\"",null,null,null,null,null,null,"    filename1 = myFile & \".json\"",null,null,null,null,null,null,null," End If"]
[" End If",null,null,null,null,null,null," End If",null,null,null,null,null,null,null,"'myFolder & Application.PathSeparator & \"output.json\""]
["'myFolder & Application.PathSeparator & \"output.json\"",null,null,null,null,null,null,"'myFolder & Application.PathSeparator & \"output.json\""]
[null,null,null,null,null,null,null,null,null,null,null,null,null,null,null,"Open filename1 For Output As #1"]
[null,null,null,null,null,null,null,null,null,null,null,null,null,null,null,"Print #1, jsonData"]
["Open filename1 For Output As #1",null,null,null,null,null,null,"Open filename1 For Output As #1",null,null,null,null,null,null,null,"For i = 2 To lrow"]
["Print #1, jsonData",null,null,null,null,null,null,"Print #1, jsonData",null,null,null,null,null,null,null,"    If Trim(wi.Cells(i, \"E\").Value2) <> \"\" Then"]
["For i = 2 To lrow",null,null,null,null,null,null,"For i = 2 To lrow",null,null,null,null,null,null,null,"        If wi.Cells(i, \"A\") <> \"\" Then"]
["    If Trim(wi.Cells(i, \"E\").Value2) <> \"\" Then",null,null,null,null,null,null,"    If Trim(wi.Cells(i, \"E\").Value2) <> \"\" Then",null,null,null,null,null,null,null,"            basey = wi.Cells(i, \"A\")"]
["        If wi.Cells(i, \"A\") <> \"\" Then",null,null,null,null,null,null,"        If wi.Cells(i, \"A\") <> \"\" Then",null,null,null,null,null,null,null,"            census = wi.Cells(i, \"B\")"]
["            basey = wi.Cells(i, \"A\")",null,null,null,null,null,null,"            basey = wi.Cells(i, \"A\")",null,null,null,null,null,null,null,"            jsonData = \"    \" & Chr(34) & headerRange.Value2(1, 1) & Chr(34) & \": \""]
["            census = wi.Cells(i, \"B\")",null,null,null,null,null,null,"            census = wi.Cells(i, \"B\")",null,null,null,null,null,null,null,"            jsonData = jsonData & wi.Cells(i, \"A\")"]
["            jsonData = \"    \" & Chr(34) & headerRange.Value2(1, 1) & Chr(34) & \": \"",null,null,null,null,null,null,"            jsonData = \"    \" & Chr(34) & headerRange.Value2(1, 1) & Chr(34) & \": \"",null,null,null,null,null,null,null,"            jsonData = jsonData & \",\""]
["            jsonData = jsonData & wi.Cells(i, \"A\")",null,null,null,null,null,null,"            jsonData = jsonData & wi.Cells(i, \"A\")",null,null,null,null,null,null,null,"            Print #1, jsonData"]
["            jsonData = jsonData & \",\"",null,null,null,null,null,null,"            jsonData = jsonData & \",\"",null,null,null,null,null,null,null,"            jsonData = \"    \" & Chr(34) & headerRange.Value2(1, 2) & Chr(34) & \": \""]
["            Print #1, jsonData",null,null,null,null,null,null,"            Print #1, jsonData",null,null,null,null,null,null,null,"            jsonData = jsonData & wi.Cells(i, \"B\")"]
["            jsonData = \"    \" & Chr(34) & headerRange.Value2(1, 2) & Chr(34) & \": \"",null,null,null,null,null,null,"            jsonData = \"    \" & Chr(34) & headerRange.Value2(1, 2) & Chr(34) & \": \"",null,null,null,null,null,null,null,"            jsonData = jsonData & \",\""]
["            jsonData = jsonData & wi.Cells(i, \"B\")",null,null,null,null,null,null,"            jsonData = jsonData & wi.Cells(i, \"B\")",null,null,null,null,null,null,null,"            Print #1, jsonData"]
["            jsonData = jsonData & \",\"",null,null,null,null,null,null,"            jsonData = jsonData & \",\"",null,null,null,null,null,null,null,"            jsonData = \"    \" & Chr(34) & headerRange.Value2(1, 3) & Chr(34) & \": \""]
["            Print #1, jsonData",null,null,null,null,null,null,"            Print #1, jsonData",null,null,null,null,null,null,null,"            jsonData = jsonData & wi.Cells(i, \"C\")"]
["            jsonData = \"    \" & Chr(34) & headerRange.Value2(1, 3) & Chr(34) & \": \"",null,null,null,null,null,null,"            jsonData = \"    \" & Chr(34) & headerRange.Value2(1, 3) & Chr(34) & \": \"",null,null,null,null,null,null,null,"            jsonData = jsonData & \"[\""]
["            jsonData = jsonData & wi.Cells(i, \"C\")",null,null,null,null,null,null,"            jsonData = jsonData & wi.Cells(i, \"C\")",null,null,null,null,null,null,null,"            Print #1, jsonData"]
["            jsonData = jsonData & \"[\"",null,null,null,null,null,null,"            jsonData = jsonData & \"[\"",null,null,null,null,null,null,null,"        End If"]
["            Print #1, jsonData",null,null,null,null,null,null,"            Print #1, jsonData",null,null,null,null,null,null,null,"        If wi.Cells(i, \"E\") <> fuelt Then"]
["        End If",null,null,null,null,null,null,"        End If",null,null,null,null,null,null,null,"            If fuelt <> \"\" Then"]
["        If wi.Cells(i, \"E\") <> fuelt Then",null,null,null,null,null,null,"        If wi.Cells(i, \"E\") <> fuelt Then",null,null,null,null,null,null,null,"                jsonData = \"    \" & \"    \" & \"    \" & \"]\""]
["            If fuelt <> \"\" Then",null,null,null,null,null,null,"            If fuelt <> \"\" Then",null,null,null,null,null,null,null,"                Print #1, jsonData"]
["                jsonData = \"    \" & \"    \" & \"    \" & \"]\"",null,null,null,null,null,null,"                jsonData = \"    \" & \"    \" & \"    \" & \"]\"",null,null,null,null,null,null,null,"                jsonData = \"    \" & \"    \" & \"},\""]
["                Print #1, jsonData",null,null,null,null,null,null,"                Print #1, jsonData",null,null,null,null,null,null,null,"                Print #1, jsonData"]
["                jsonData = \"    \" & \"    \" & \"},\"",null,null,null,null,null,null,"                jsonData = \"    \" & \"    \" & \"},\"",null,null,null,null,null,null,null,"            End If"]
["                Print #1, jsonData",null,null,null,null,null,null,"                Print #1, jsonData",null,null,null,null,null,null,null,"            fuelt = wi.Cells(i, \"E\")"]
["            End If",null,null,null,null,null,null,"            End If",null,null,null,null,null,null,null,"            fueltid = wi.Cells(i, \"D\")"]
["            fuelt = wi.Cells(i, \"E\")",null,null,null,null,null,null,"            fuelt = wi.Cells(i, \"E\")",null,null,null,null,null,null,null,"            jsonData = \"    \" & \"    \" & \"{\""]
["            fueltid = wi.Cells(i, \"D\")",null,null,null,null,null,null,"            fueltid = wi.Cells(i, \"D\")",null,null,null,null,null,null,null,"            Print #1, jsonData"]
["            jsonData = \"    \" & \"    \" & \"{\"",null,null,null,null,null,null,"            jsonData = \"    \" & \"    \" & \"{\"",null,null,null,null,null,null,null,"            jsonData = \"    \" & \"    \" & \"    \" & Chr(34) & headerRange.Value2(1, 4) & Chr(34) & \": \""]
["            Print #1, jsonData",null,null,null,null,null,null,"            Print #1, jsonData",null,null,null,null,null,null,null,"            jsonData = jsonData & fueltid"]
["            jsonData = \"    \" & \"    \" & \"    \" & Chr(34) & headerRange.Value2(1, 4) & Chr(34) & \": \"",null,null,null,null,null,null,"            jsonData = \"    \" & \"    \" & \"    \" & Chr(34) & headerRange.Value2(1, 4) & Chr(34) & \": \"",null,null,null,null,null,null,null,"            jsonData = jsonData & \",\""]
["            jsonData = jsonData & fueltid",null,null,null,null,null,null,"            jsonData = jsonData & fueltid",null,null,null,null,null,null,null,"            Print #1, jsonData"]
["            jsonData = jsonData & \",\"",null,null,null,null,null,null,"            jsonData = jsonData & \",\"",null,null,null,null,null,null,null,"            jsonData = \"    \" & \"    \" & \"    \" & Chr(34) & headerRange.Value2(1, 5) & Chr(34) & \": \""]
["            Print #1, jsonData",null,null,null,null,null,null,"            Print #1, jsonData",null,null,null,null,null,null,null,"            jsonData = jsonData & Chr(34) & fuelt & Chr(34)"]
["            jsonData = \"    \" & \"    \" & \"    \" & Chr(34) & headerRange.Value2(1, 5) & Chr(34) & \": \"",null,null,null,null,null,null,"            jsonData = \"    \" & \"    \" & \"    \" & Chr(34) & headerRange.Value2(1, 5) & Chr(34) & \": \"",null,null,null,null,null,null,null,"            jsonData = jsonData & \",\""]
["            jsonData = jsonData & Chr(34) & fuelt & Chr(34)",null,null,null,null,null,null,"            jsonData = jsonData & Chr(34) & fuelt & Chr(34)",null,null,null,null,null,null,null,"            Print #1, jsonData"]
["            jsonData = jsonData & \",\"",null,null,null,null,null,null,"            jsonData = jsonData & \",\"",null,null,null,null,null,null,null,"            jsonData = \"    \" & \"    \" & \"    \" & Chr(34) & headerRange.Value2(1, 6) & Chr(34) & \": \""]
["            Print #1, jsonData",null,null,null,null,null,null,"            Print #1, jsonData",null,null,null,null,null,null,null,"            jsonData = jsonData & \"[\""]
["            jsonData = \"    \" & \"    \" & \"    \" & Chr(34) & headerRange.Value2(1, 6) & Chr(34) & \": \"",null,null,null,null,null,null,"            jsonData = \"    \" & \"    \" & \"    \" & Chr(34) & headerRange.Value2(1, 6) & Chr(34) & \": \"",null,null,null,null,null,null,null,"            Print #1, jsonData"]
["            jsonData = jsonData & \"[\"",null,null,null,null,null,null,"            jsonData = jsonData & \"[\"",null,null,null,null,null,null,null,"        End If"]
["            Print #1, jsonData",null,null,null,null,null,null,"            Print #1, jsonData",null,null,null,null,null,null,null,"            "]
["        End If",null,null,null,null,null,null,"        End If",null,null,null,null,null,null,null,"        jsonData = \"    \" & \"    \" & \"    \" & \"    \" & wi.Cells(i, \"F\")"]
["            ",null,null,null,null,null,null,"            ",null,null,null,null,null,null,null,"        jsonData = jsonData & \",\""]
["        jsonData = \"    \" & \"    \" & \"    \" & \"    \" & wi.Cells(i, \"F\")",null,null,null,null,null,null,"        jsonData = \"    \" & \"    \" & \"    \" & \"    \" & wi.Cells(i, \"F\")",null,null,null,null,null,null,null,"        Print #1, jsonData"]
["        jsonData = jsonData & \",\"",null,null,null,null,null,null,"        jsonData = jsonData & \",\"",null,null,null,null,null,null,null,"    End If"]
["        Print #1, jsonData",null,null,null,null,null,null,"        Print #1, jsonData",null,null,null,null,null,null,null,"Next"]
["    End If",null,null,null,null,null,null,"    End If"]
["Next",null,null,null,null,null,null,"Next",null,null,null,null,null,null,null,"jsonData = \"    \" & \"    \" & \"    \" & \"]\""]
[null,null,null,null,null,null,null,null,null,null,null,null,null,null,null,"Print #1, jsonData"]
["jsonData = \"    \" & \"    \" & \"    \" & \"]\"",null,null,null,null,null,null,"jsonData = \"    \" & \"    \" & \"    \" & \"]\"",null,null,null,null,null,null,null,"jsonData = \"    \" & \"    \" & \"}\""]
["Print #1, jsonData",null,null,null,null,null,null,"Print #1, jsonData",null,null,null,null,null,null,null,"Print #1, jsonData"]
["jsonData = \"    \" & \"    \" & \"}\"",null,null,null,null,null,null,"jsonData = \"    \" & \"    \" & \"}\"",null,null,null,null,null,null,null,"jsonData = \"    \" & \"]\""]
["Print #1, jsonData",null,null,null,null,null,null,"Print #1, jsonData",null,null,null,null,null,null,null,"Print #1, jsonData"]
["jsonData = \"    \" & \"]\"",null,null,null,null,null,null,"jsonData = \"    \" & \"]\"",null,null,null,null,null,null,null,"jsonData = \"}\""]
["Print #1, jsonData",null,null,null,null,null,null,"Print #1, jsonData",null,null,null,null,null,null,null,"Print #1, jsonData"]
["jsonData = \"}\"",null,null,null,null,null,null,"jsonData = \"}\"",null,null,null,null,null,null,null,"Close #1"]
["Print #1, jsonData",null,null,null,null,null,null,"Print #1, jsonData"]
["Close #1",null,null,null,null,null,null,"Close #1",null,null,null,null,null,null,null,"MsgBox \"JSON File generated into \" & filename1"]
[]
["MsgBox \"JSON File generated into \" & filename1",null,null,null,null,null,null,"MsgBox \"JSON File generated into \" & filename1",null,null,null,null,null,null,null,"End Sub"]
[]
["End Sub",null,null,null,null,null,null,"End Sub"]

{"sheet":"States","index":12,"n_rows":56,"n_cols":10,"rows_kept":56,"cut":false,"hidden":true,"merged":[]}
["State","Region Name"]
["Alabama","Region 3 - South",null,null,"Alabama"]
["Alaska","Region 4 - West",null,null,"Alaska"]
["Arizona","Region 4 - West",null,null,"Arizona"]
["Arkansas","Region 3 - South",null,null,"Arkansas",null,null,null,"Region 1 - Northeast",1]
["California","Region 4 - West",null,null,"California",null,null,null,"Region 2 - Midwest",2]
["Colorado","Region 4 - West",null,null,"Colorado",null,null,null,"Region 3 - South",3]
["Connecticut","Region 1 - Northeast",null,null,"Connecticut",null,null,null,"Region 4 - West",4]
["Delaware","Region 3 - South",null,null,"Delaware",null,null,null,"Region 5 - US",5]
["District of Columbia","Region 3 - South",null,null,"District of Columbia"]
["Florida","Region 3 - South",null,null,"Florida",null,null,null,{"$f":"IF('User Inputs_FPI_Calculator'!I5=\"Region 1 - Northeast\", 1, IF('User Inputs_FPI_Calculator'!I5=\"Region 2 - Midwest\", 2, IF('User Inputs_FPI_Calculator'!I5=\"Region 3 - South\", 3, IF('User Inputs_FPI_Calculator'!I5=\"Region 4 - West\", 4, IF('User Inputs_FPI_Calculator'!I5=\"Region 5 - US\", 5, \"\")))))","v":4}]
["Georgia","Region 3 - South",null,null,"Georgia"]
["Hawaii","Region 4 - West",null,null,"Hawaii"]
["Idaho","Region 4 - West",null,null,"Idaho"]
["Illinois","Region 2 - Midwest",null,null,"Illinois"]
["Indiana","Region 2 - Midwest",null,null,"Indiana"]
["Iowa","Region 2 - Midwest",null,null,"Iowa"]
["Kansas","Region 2 - Midwest",null,null,"Kansas"]
["Kentucky","Region 3 - South",null,null,"Kentucky"]
["Louisiana","Region 3 - South",null,null,"Louisiana"]
["Maine","Region 1 - Northeast",null,null,"Maine"]
["Maryland","Region 3 - South",null,null,"Maryland"]
["Massachusetts","Region 1 - Northeast",null,null,"Massachusetts"]
["Michigan","Region 2 - Midwest",null,null,"Michigan"]
["Minnesota","Region 2 - Midwest",null,null,"Minnesota"]
["Mississippi","Region 3 - South",null,null,"Mississippi"]
["Missouri","Region 2 - Midwest",null,null,"Missouri"]
["Montana","Region 4 - West",null,null,"Montana"]
["Nebraska","Region 2 - Midwest",null,null,"Nebraska"]
["Nevada","Region 4 - West",null,null,"Nevada"]
["New Hampshire","Region 1 - Northeast",null,null,"New Hampshire"]
["New Jersey","Region 1 - Northeast",null,null,"New Jersey"]
["New Mexico","Region 4 - West",null,null,"New Mexico"]
["New York","Region 1 - Northeast",null,null,"New York"]
["North Carolina","Region 3 - South",null,null,"North Carolina"]
["North Dakota","Region 2 - Midwest",null,null,"North Dakota"]
["Ohio","Region 2 - Midwest",null,null,"Ohio"]
["Oklahoma","Region 3 - South",null,null,"Oklahoma"]
["Oregon","Region 4 - West",null,null,"Oregon"]
["Pennsylvania","Region 1 - Northeast",null,null,"Pennsylvania"]
["Rhode Island","Region 1 - Northeast",null,null,"Rhode Island"]
["South Carolina","Region 3 - South",null,null,"South Carolina"]
["South Dakota","Region 2 - Midwest",null,null,"South Dakota"]
["Tennessee","Region 3 - South",null,null,"Tennessee"]
["Texas","Region 3 - South",null,null,"Texas"]
["US","Region 5 - US",null,null,"Utah"]
["Utah","Region 4 - West",null,null,"Vermont"]
["Vermont","Region 1 - Northeast",null,null,"Virginia"]
["Virginia","Region 3 - South",null,null,"Washington"]
["Washington","Region 4 - West",null,null,"West Virginia"]
["West Virginia","Region 3 - South",null,null,"Wisconsin"]
["Wisconsin","Region 2 - Midwest",null,null,"Wyoming"]
["Wyoming","Region 4 - West"]
[]
[]
[null,{"$f":"ToColletter","v":{"$error":"#NAME?"}}]

{"sheet":"Sheet3","index":13,"n_rows":249,"n_cols":7,"rows_kept":249,"cut":false,"hidden":true,"merged":[]}
["Fuel Type","Year","Region 5 - US","Region 1 - Noertheast","Region 2 - Midwest","Region 3 - South","Region 4 - West"]
["Electricity",0,1,1,1,1,1]
["Electricity",1,0.99502359641612781,1.0195608596508192,0.99162838678213061,0.99831013202143115,0.97796393722181196]
["Electricity",2,0.97821297213082592,1.0163926836206973,0.98274709601145671,0.9841588506471961,0.94229416491739582]
["Electricity",3,0.97032925021420591,1.0205199257419511,0.98127338078512027,0.97052226238314165,0.93629764693639239]
["Electricity",4,0.96909780724824535,1.0270835777146148,0.97409480830903594,0.96266120804374811,0.9499868335224394]
["Electricity",5,0.97141183039922985,1.0384339367356252,0.96940827864097412,0.96318517046867647,0.95848715219004643]
["Electricity",6,0.9754866581709587,1.0476521910687964,0.9674893584944978,0.96832286001766821,0.9640269945190445]
["Electricity",7,0.97974978823959569,1.0527552167714191,0.96419050000887563,0.97563519840073321,0.96864271972541449]
["Electricity",8,0.98279609473478591,1.046388626105794,0.97271501136596461,0.97932736011223243,0.97582924983030861]
["Electricity",9,0.98682183906181242,1.0523522276815513,0.97440798310488208,0.98014084112975475,0.98724999534281455]
["Electricity",10,0.99054623849559498,1.0578598308586979,0.97648579792996459,0.98147795450801634,0.99798011398203235]
["Electricity",11,0.99625175923259723,1.0729188177082829,0.97415158582856787,0.98682562163403098,1.0053370316932133]
["Electricity",12,1.0013995986306969,1.0937059873288644,0.96858883751798019,0.9913915883022556,1.0107915056086891]
["Electricity",13,0.99943663151319406,1.0935962900587406,0.96417200624548971,0.98843865605519254,1.0137690245519888]
["Electricity",14,0.99755311675919689,1.094473209473978,0.96073188935092912,0.98494353266140366,1.0164903535630261]
["Electricity",15,0.99430586059199844,1.0980171780054691,0.95644978379832857,0.97777886512051049,1.0192680729669845]
["Electricity",16,0.99030766331556341,1.0937967572458291,0.95222977220042038,0.97192558261665762,1.0213383190593186]
["Electricity",17,0.9899980395209943,1.1037410568571266,0.94930795750540453,0.96968689317042411,1.0218358087937898]
["Electricity",18,0.99048437064655348,1.1114807270975275,0.94808965622372765,0.96857412787174879,1.0240386008576574]
["Electricity",19,0.98874123880111853,1.1108063816645632,0.94581234080465293,0.96518125072648797,1.0270975666783486]
["Electricity",20,0.98851277216998723,1.1219711612512462,0.94286830290346524,0.96149749141525565,1.0303176585069327]
["Electricity",21,0.98739312513563382,1.131912048950527,0.9381546918898791,0.95751422133838704,1.0324474933579662]
["Electricity",22,0.98279823256162657,1.1226793415837784,0.93388703728193845,0.95180319847295103,1.0355971134995252]
["Electricity",23,0.98200667375140438,1.126973186366365,0.93136181367885429,0.9489374394257476,1.039574728151559]
["Electricity",24,0.98146714032800186,1.1308050551834814,0.92916812798005766,0.94610236722899044,1.0445806780089641]
["Electricity",25,0.97984078634642302,1.1201924094246529,0.92658533563587664,0.94586333412403023,1.0485578885321103]
["Electricity",26,0.98049214143958352,1.1240367252938066,0.9235013069999275,0.94620936683136481,1.0519281236150957]
["Electricity",27,0.97940748299245417,1.1264086604138563,0.91850676356623095,0.94421396436508465,1.0548621556134434]
["Electricity",28,0.97419617152813054,1.1126239915333138,0.91317417349457175,0.93872772751807998,1.0580982498261362]
["Electricity",29,0.971199128990899,1.1049176044051814,0.90958039451752826,0.93544080380057448,1.0617237465970475]
["Electricity",30,0.96930031351125612,1.1007132764692138,0.90600075878687802,0.93319099538512262,1.0654411396946428]
["Natural Gas",0,1,1,1,1,1]
["Natural Gas",1,0.97171916165801697,0.96799003418159468,0.9338049050170194,0.99341813279903002,1.0217194333223938]
["Natural Gas",2,0.93031666956516346,0.92944616659661361,0.88442701484138231,0.9776482408467847,0.96925992186627996]
["Natural Gas",3,0.9025355212046281,0.90473548827112649,0.86465679857905098,0.96820760041684784,0.9082872395152658]
["Natural Gas",4,0.88687863801686073,0.88951898029621279,0.86011669583466599,0.96796344100593823,0.86110299591521833]
["Natural Gas",5,0.87872059638208522,0.88122465990923449,0.8665330617359368,0.97392101252573793,0.81939579315657862]
["Natural Gas",6,0.88390125178433643,0.88007185293211598,0.88042792659579505,0.98508909376571618,0.81365020242737818]
["Natural Gas",7,0.89725646875679788,0.88518149528701218,0.90033718768436177,0.99944888239129204,0.82568762078151559]
["Natural Gas",8,0.90599825984568216,0.89030913011760282,0.91184161725451829,1.0092443855475863,0.83290861766400448]
["Natural Gas",9,0.93177846197388181,0.89343115231453751,0.92192499185172727,1.0179483029837961,0.91638157893089034]
["Natural Gas",10,0.94292019403451788,0.8924611068048196,0.92754511989964217,1.0251394487986751,0.95092805321043306]
["Natural Gas",11,0.95410533229767436,0.89865492319748252,0.93657554875155169,1.034266784709919,0.97119338696981938]
["Natural Gas",12,0.96011900305125952,0.90172112956804795,0.9404597778643482,1.041148580971444,0.98110342001438899]
["Natural Gas",13,0.95840890843993376,0.89480593846357637,0.93827055757877842,1.043833000379556,0.98017533296511283]
["Natural Gas",14,0.95841619286784263,0.88981608860775363,0.93837544275575613,1.0474439884666416,0.98089348785979702]
["Natural Gas",15,0.961811064475385,0.89141125397189558,0.9415587455946911,1.0529004246521494,0.98355895278267391]
["Natural Gas",16,0.96428359116393625,0.89182294971847842,0.94427957441770483,1.0578703080645955,0.98458464948067337]
["Natural Gas",17,0.96694265048331529,0.89275831777097714,0.94677909234211932,1.0624132813236444,0.9865857625577592]
["Natural Gas",18,0.96890117318151725,0.89160662002624402,0.94889313777079809,1.0670858213805789,0.98815110974169496]
["Natural Gas",19,0.97075428850970591,0.8871125442455452,0.95160922836281647,1.0718219858540909,0.99203399687859017]
["Natural Gas",20,0.97128848986785976,0.88376642959418528,0.95244675995804406,1.075056625145187,0.99291617326957959]
["Natural Gas",21,0.971747681472237,0.88127791198891581,0.95336702495824277,1.0783926676886715,0.99238382871703223]
["Natural Gas",22,0.97084759726284542,0.87778334278450154,0.95154820167755627,1.0792826557042736,0.99273230199338558]
["Natural Gas",23,0.97164153341051873,0.87758183897951703,0.95082834016249662,1.0807369674641183,0.99485658156589618]
["Natural Gas",24,0.97274581293814832,0.87699453816613149,0.95129446827797171,1.0832958869639031,0.99621121705431515]
["Natural Gas",25,0.97418178312635029,0.8766192927284342,0.95197554053273603,1.0861585178687734,0.99814722395983235]
["Natural Gas",26,0.97472090405381007,0.87519905639857509,0.95260413173429326,1.0894197497125162,0.99716343041946454]
["Natural Gas",27,0.97677685450945595,0.87756126213041796,0.9541369987910423,1.0926861776235433,0.99747381293676407]
["Natural Gas",28,0.97815935583921099,0.87665355513236431,0.95583320563626306,1.095722730798097,0.99836292657891224]
["Natural Gas",29,0.97935672950326824,0.87577005672317332,0.95706142938545413,1.098771926584948,0.99902748413923703]
["Natural Gas",30,0.98063814867678079,0.8754138069394275,0.95815066875926547,1.1018531126742006,0.99964122677957268]
["Propane/LPG",0,1,1,1,1,1]
["Propane/LPG",1,1.0123248626190167,1.0130846488154006,1.0130846488154006,1.0133988908839831,1.0116308406664705]
["Propane/LPG",2,1.0113685051573904,1.0123777869321617,1.0123777869321617,1.0127478229852946,1.0103863821339272]
["Propane/LPG",3,1.0100096983526878,1.0110069548204375,1.0110069548204375,1.0114422311068376,1.0089217829348174]
["Propane/LPG",4,1.0122125441975149,1.0131946125641877,1.0131946125641877,1.0137002634851933,1.0109469055818256]
["Propane/LPG",5,1.0234846471154706,1.0245033042012122,1.0245033042012122,1.0250805434553358,1.0219403190779268]
["Propane/LPG",6,1.0440770914988009,1.0451827687222546,1.0451827687222546,1.0458396022197207,1.0421594799253473]
["Propane/LPG",7,1.0660445392732829,1.067243383328123,1.067243383328123,1.0679807010831353,1.0637391091188666]
["Propane/LPG",8,1.0882534120635881,1.0895400212069326,1.0895400212069326,1.0903606132932655,1.085565866273219]
["Propane/LPG",9,1.1158103460702722,1.1113851164317916,1.1113851164317916,1.1122977989999883,1.1411594619966658]
["Propane/LPG",10,1.1376042667935502,1.1313488099619375,1.1313488099619375,1.1323553403374103,1.1722238286212434]
["Propane/LPG",11,1.1567071130995008,1.1497521185350759,1.1497521185350759,1.1508539255999652,1.1947725565942509]
["Propane/LPG",12,1.1719912370106751,1.1648148845296338,1.1648148845296338,1.1660182513151229,1.2109443629151739]
["Propane/LPG",13,1.1834684850178467,1.1763064517068942,1.1763064517068942,1.1776047525184208,1.2220058415362738]
["Propane/LPG",14,1.1937631328509022,1.1865825721585199,1.1865825721585199,1.1879846961260991,1.2318991264037431]
["Propane/LPG",15,1.2045948472418788,1.1973823168098487,1.1973823168098487,1.1988900875339035,1.242328532745349]
["Propane/LPG",16,1.2154900982062273,1.2082355694610203,1.2082355694610203,1.2098569640949295,1.2528269984684965]
["Propane/LPG",17,1.2242403211759871,1.2169399473220575,1.2169399473220575,1.2186725354935526,1.2612126001888901]
["Propane/LPG",18,1.2359933840897626,1.2286418589903083,1.2286418589903083,1.2304914450050244,1.2725583945758323]
["Propane/LPG",19,1.2477335856386886,1.2403246964366381,1.2403246964366381,1.2422946145296054,1.2839025563988702]
["Propane/LPG",20,1.2551891523013867,1.2476925937744945,1.2476925937744945,1.2497833003978864,1.2910161241966962]
["Propane/LPG",21,1.263442015199632,1.2558457194767156,1.2558457194767156,1.2580519431058057,1.2989168472254138]
["Propane/LPG",22,1.2738396645802934,1.2661358093729445,1.2661358093729445,1.2684694048989644,1.3089277002564921]
["Propane/LPG",23,1.2812119504062018,1.2733702183349078,1.2733702183349078,1.2758295991167929,1.3159374600628808]
["Propane/LPG",24,1.2877597221813979,1.2797566618247354,1.2797566618247354,1.2823328593872745,1.3221374318720587]
["Propane/LPG",25,1.2935532488392796,1.2853626343557369,1.2853626343557369,1.2880614874313072,1.3275937162434737]
["Propane/LPG",26,1.2978699377946747,1.2894740945596062,1.2894740945596062,1.2922960637078507,1.331581182580498]
["Propane/LPG",27,1.2999072703041705,1.2912834397237203,1.2912834397237203,1.2942145720241811,1.333325891812229]
["Propane/LPG",28,1.3003764104854689,1.2915048972689338,1.2915048972689338,1.2945487591908831,1.333523537693984]
["Propane/LPG",29,1.3030858106381453,1.293990640887126,1.293990640887126,1.2971519814169112,1.3359281887686756]
["Propane/LPG",30,1.3066549143687565,1.2973446194995841,1.2973446194995841,1.300624666160745,1.3391787756944706]
["Fuel Oil",0,1,1,1,1,1]
["Fuel Oil",1,0.99268342245905961,0.99616013098640366,0.93807197215287141,0.98680233474810275,0.98443728987177059]
["Fuel Oil",2,1.0364404205815929,1.0412064482841386,0.9541466427948192,1.033930675477732,1.0286092618335263]
["Fuel Oil",3,1.070781793493057,1.0773762262339508,0.9548195083014851,1.069456719316229,1.0608500407212966]
["Fuel Oil",4,1.0959991212118867,1.1045868693796594,0.94510922468530756,1.0957093177118369,1.0832284029769694]
["Fuel Oil",5,1.1243644379953659,1.1346877996848352,0.94163012138647895,1.1265011095088335,1.1103778875271666]
["Fuel Oil",6,1.1380448411526949,1.1487073412012812,0.95126648949387704,1.14230090929251,1.1253775417816361]
["Fuel Oil",7,1.1442841288815815,1.155034834138587,0.96042807324088497,1.1493363831655377,1.1321500492552998]
["Fuel Oil",8,1.1444305081971144,1.1552627126862312,0.9621371301859164,1.1505730808393244,1.1329575790438984]
["Fuel Oil",9,1.1533770528516658,1.1639548953338255,0.9753515424965985,1.1595796672401704,1.1506045116638723]
["Fuel Oil",10,1.1600732224166739,1.1703579583161345,0.98672595948048059,1.1688547103929225,1.1614660855068688]
["Fuel Oil",11,1.1634029257324523,1.1736801655025595,0.99345144687769027,1.1733370263002718,1.1657932916883478]
["Fuel Oil",12,1.1657986429454146,1.1760274425364967,0.99866752306290196,1.1776183445359036,1.1697076641230848]
["Fuel Oil",13,1.1690649141604388,1.1792970770625277,1.0044985869970955,1.1826445819947806,1.1739933128885525]
["Fuel Oil",14,1.1757538571894051,1.1861219219565098,1.0134897972906103,1.1897477383143908,1.1815223485825324]
["Fuel Oil",15,1.1850694172988263,1.1955977228702164,1.0258176995178789,1.1993142529654577,1.1907761490576123]
["Fuel Oil",16,1.1918807248494658,1.2025601442995744,1.0351000082271953,1.206520668304959,1.1981719509316593]
["Fuel Oil",17,1.1956654012440489,1.2065942561877541,1.040123066211005,1.2104570574602025,1.2018906291870406]
["Fuel Oil",18,1.2040872039430655,1.2152272708241616,1.0516145692329655,1.2193452990053326,1.2084583208001389]
["Fuel Oil",19,1.2099652910904029,1.2212978208160095,1.0597046934883931,1.2256300238577729,1.2141910123363058]
["Fuel Oil",20,1.2115027049440679,1.2229878141484332,1.0619465784584521,1.227399226845286,1.2187067313773798]
["Fuel Oil",21,1.2193713158511288,1.2309752370091194,1.0724048974643654,1.2355557446836358,1.2284541818352628]
["Fuel Oil",22,1.2307676774437712,1.2424589106657624,1.0876277124753484,1.247388724593369,1.241268598643859]
["Fuel Oil",23,1.2370811317623924,1.2489516530805691,1.0959574816498896,1.2538884100848975,1.2491508360281045]
["Fuel Oil",24,1.2452322336315949,1.2571877413116603,1.1072569960837828,1.2626325148627107,1.2593955925164975]
["Fuel Oil",25,1.2485732354342831,1.2606994970808696,1.1114306900238087,1.2659555071730615,1.2664842016109916]
["Fuel Oil",26,1.2462380079606321,1.2586516950180253,1.1082549390170222,1.2636126257488602,1.2666795035744229]
["Fuel Oil",27,1.2448370474187263,1.2575462969846996,1.1068948468709392,1.2626138173981609,1.2658609201482962]
["Fuel Oil",28,1.2428619701287451,1.256025263057309,1.1037767986134646,1.2603027205166051,1.2631127619231015]
["Fuel Oil",29,1.2428773523837686,1.2563730139901819,1.1035801880127718,1.2602337391539753,1.2639985136165728]
["Fuel Oil",30,1.2436992737302661,1.2574692076929335,1.1046716743614613,1.2611486851197555,1.2663409397018806]
["Kerosene",0,1,1,1,1,1]
["Kerosene",1,0.99268342245905961,0.99616013098640366,0.93807197215287141,0.98680233474810275,0.98443728987177059]
["Kerosene",2,1.0364404205815929,1.0412064482841386,0.9541466427948192,1.033930675477732,1.0286092618335263]
["Kerosene",3,1.070781793493057,1.0773762262339508,0.9548195083014851,1.069456719316229,1.0608500407212966]
["Kerosene",4,1.0959991212118867,1.1045868693796594,0.94510922468530756,1.0957093177118369,1.0832284029769694]
["Kerosene",5,1.1243644379953659,1.1346877996848352,0.94163012138647895,1.1265011095088335,1.1103778875271666]
["Kerosene",6,1.1380448411526949,1.1487073412012812,0.95126648949387704,1.14230090929251,1.1253775417816361]
["Kerosene",7,1.1442841288815815,1.155034834138587,0.96042807324088497,1.1493363831655377,1.1321500492552998]
["Kerosene",8,1.1444305081971144,1.1552627126862312,0.9621371301859164,1.1505730808393244,1.1329575790438984]
["Kerosene",9,1.1533770528516658,1.1639548953338255,0.9753515424965985,1.1595796672401704,1.1506045116638723]
["Kerosene",10,1.1600732224166739,1.1703579583161345,0.98672595948048059,1.1688547103929225,1.1614660855068688]
["Kerosene",11,1.1634029257324523,1.1736801655025595,0.99345144687769027,1.1733370263002718,1.1657932916883478]
["Kerosene",12,1.1657986429454146,1.1760274425364967,0.99866752306290196,1.1776183445359036,1.1697076641230848]
["Kerosene",13,1.1690649141604388,1.1792970770625277,1.0044985869970955,1.1826445819947806,1.1739933128885525]
["Kerosene",14,1.1757538571894051,1.1861219219565098,1.0134897972906103,1.1897477383143908,1.1815223485825324]
["Kerosene",15,1.1850694172988263,1.1955977228702164,1.0258176995178789,1.1993142529654577,1.1907761490576123]
["Kerosene",16,1.1918807248494658,1.2025601442995744,1.0351000082271953,1.206520668304959,1.1981719509316593]
["Kerosene",17,1.1956654012440489,1.2065942561877541,1.040123066211005,1.2104570574602025,1.2018906291870406]
["Kerosene",18,1.2040872039430655,1.2152272708241616,1.0516145692329655,1.2193452990053326,1.2084583208001389]
["Kerosene",19,1.2099652910904029,1.2212978208160095,1.0597046934883931,1.2256300238577729,1.2141910123363058]
["Kerosene",20,1.2115027049440679,1.2229878141484332,1.0619465784584521,1.227399226845286,1.2187067313773798]
["Kerosene",21,1.2193713158511288,1.2309752370091194,1.0724048974643654,1.2355557446836358,1.2284541818352628]
["Kerosene",22,1.2307676774437712,1.2424589106657624,1.0876277124753484,1.247388724593369,1.241268598643859]
["Kerosene",23,1.2370811317623924,1.2489516530805691,1.0959574816498896,1.2538884100848975,1.2491508360281045]
["Kerosene",24,1.2452322336315949,1.2571877413116603,1.1072569960837828,1.2626325148627107,1.2593955925164975]
["Kerosene",25,1.2485732354342831,1.2606994970808696,1.1114306900238087,1.2659555071730615,1.2664842016109916]
["Kerosene",26,1.2462380079606321,1.2586516950180253,1.1082549390170222,1.2636126257488602,1.2666795035744229]
["Kerosene",27,1.2448370474187263,1.2575462969846996,1.1068948468709392,1.2626138173981609,1.2658609201482962]
["Kerosene",28,1.2428619701287451,1.256025263057309,1.1037767986134646,1.2603027205166051,1.2631127619231015]
["Kerosene",29,1.2428773523837686,1.2563730139901819,1.1035801880127718,1.2602337391539753,1.2639985136165728]
["Kerosene",30,1.2436992737302661,1.2574692076929335,1.1046716743614613,1.2611486851197555,1.2663409397018806]
["Wood",0,1,1,1,1,1]
["Wood",1,1,1,1,1,1]
["Wood",2,1,1,1,1,1]
["Wood",3,1,1,1,1,1]
["Wood",4,1,1,1,1,1]
["Wood",5,1,1,1,1,1]
["Wood",6,1,1,1,1,1]
["Wood",7,1,1,1,1,1]
["Wood",8,1,1,1,1,1]
["Wood",9,1,1,1,1,1]
["Wood",10,1,1,1,1,1]
["Wood",11,1,1,1,1,1]
["Wood",12,1,1,1,1,1]
["Wood",13,1,1,1,1,1]
["Wood",14,1,1,1,1,1]
["Wood",15,1,1,1,1,1]
["Wood",16,1,1,1,1,1]
["Wood",17,1,1,1,1,1]
["Wood",18,1,1,1,1,1]
["Wood",19,1,1,1,1,1]
["Wood",20,1,1,1,1,1]
["Wood",21,1,1,1,1,1]
["Wood",22,1,1,1,1,1]
["Wood",23,1,1,1,1,1]
["Wood",24,1,1,1,1,1]
["Wood",25,1,1,1,1,1]
["Wood",26,1,1,1,1,1]
["Wood",27,1,1,1,1,1]
["Wood",28,1,1,1,1,1]
["Wood",29,1,1,1,1,1]
["Wood",30,1,1,1,1,1]
["Coal",0,1,1,1,1,1]
["Coal",1,1.0012487787172408,0.97748282918049079,0.99977179773670266,0.99977179773670266,0.99810963749726589]
["Coal",2,1.0034180568037305,0.97138808027834678,1.004341291486375,1.004341291486375,0.99314433997547247]
["Coal",3,1.0034187001346477,0.97784468731549012,1.0087964577781874,1.0087964577781874,0.99111312016151432]
["Coal",4,1.000289956051239,0.98088249331996291,1.0115471361413766,1.0115471361413766,0.98673316921067367]
["Coal",5,0.99637756826263923,0.98249061162037732,1.0138600018812955,1.0138600018812955,0.98115798278770339]
["Coal",6,0.99538158562933288,0.9882204868713349,1.0175766738443406,1.0175766738443406,0.97762052062100402]
["Coal",7,0.99552151176266346,0.99600603850198,1.0219296582295452,1.0219296582295452,0.97494403912791106]
["Coal",8,0.99603393360358905,1.0041984738262555,1.0267145094674415,1.0267145094674415,0.97358036281218607]
["Coal",9,0.99724197097874201,1.0135508401570088,1.0324561326468791,1.0324561326468791,0.97210599576724588]
["Coal",10,0.99830790501777966,1.0224664073759222,1.0375297556674221,1.0375297556674221,0.96970795912079555]
["Coal",11,0.99965347871903076,1.0309953379389163,1.0421214443087139,1.0421214443087139,0.96675866635092311]
["Coal",12,1.0005589367785557,1.0385842588394678,1.0461588947919922,1.0461588947919922,0.9636363157539638]
["Coal",13,0.99977266886512517,1.041879101782198,1.0490189134788772,1.0490189134788772,0.96009429326608076]
["Coal",14,0.99883977267322877,1.0473916516699626,1.0525987477218941,1.0525987477218941,0.95670986321899043]
["Coal",15,0.99842852214470224,1.0539783516950318,1.0564347811489045,1.0564347811489045,0.95334518348170882]
["Coal",16,1.0002764610392283,1.0614653381727703,1.059577750211681,1.059577750211681,0.95000062064542157]
["Coal",17,1.0019257632050993,1.0700297785868649,1.0638092616365993,1.0638092616365993,0.94666924313266598]
["Coal",18,1.0036851121695283,1.0779659310458161,1.06855566687399,1.06855566687399,0.94360649316159662]
["Coal",19,1.0057481773835468,1.0064752775786423,1.0745069863061298,1.0745069863061298,0.94081376984272225]
["Coal",20,1.0051220935993832,0.97913588600973067,1.074514778839543,1.074514778839543,0.93755800001395051]
["Coal",21,1.0057375227421896,0.97676250730439762,1.0780409103766535,1.0780409103766535,0.93570971099901867]
["Coal",22,1.0076342126263831,0.97734005482292474,1.0842679867123513,1.0842679867123513,0.93389162564975459]
["Coal",23,1.0098604268829916,0.97829512717912981,1.0902298457622894,1.0902298457622894,0.93212724250171708]
["Coal",24,1.0118340473031915,0.9790650220522501,1.0959060517789425,1.0959060517789425,0.92993323701713637]
["Coal",25,1.0131452694263514,0.9795069784572048,1.1009581998174287,1.1009581998174287,0.92717959888926715]
["Coal",26,1.0139274037848243,0.9795007472924725,1.1057605828036012,1.1057605828036012,0.92396906197092366]
["Coal",27,1.0153664694976052,0.97955251715278968,1.1110645272467445,1.1110645272467445,0.92098428456009496]
["Coal",28,1.0169970831882209,0.97961162480531971,1.1167528891372995,1.1167528891372995,0.91816507412685322]
["Coal",29,1.0173994915774434,0.97962216959396076,1.1181954011643325,1.1181954011643325,0.91746560337802696]
["Coal",30,1.0173994915774434,0.97962216959396076,1.1181954011643325,1.1181954011643325,0.91746560337802696]
["Other",0,1,1,1,1,1]
["Other",1,1,1,1,1,1]
["Other",2,1,1,1,1,1]
["Other",3,1,1,1,1,1]
["Other",4,1,1,1,1,1]
["Other",5,1,1,1,1,1]
["Other",6,1,1,1,1,1]
["Other",7,1,1,1,1,1]
["Other",8,1,1,1,1,1]
["Other",9,1,1,1,1,1]
["Other",10,1,1,1,1,1]
["Other",11,1,1,1,1,1]
["Other",12,1,1,1,1,1]
["Other",13,1,1,1,1,1]
["Other",14,1,1,1,1,1]
["Other",15,1,1,1,1,1]
["Other",16,1,1,1,1,1]
["Other",17,1,1,1,1,1]
["Other",18,1,1,1,1,1]
["Other",19,1,1,1,1,1]
["Other",20,1,1,1,1,1]
["Other",21,1,1,1,1,1]
["Other",22,1,1,1,1,1]
["Other",23,1,1,1,1,1]
["Other",24,1,1,1,1,1]
["Other",25,1,1,1,1,1]
["Other",26,1,1,1,1,1]
["Other",27,1,1,1,1,1]
["Other",28,1,1,1,1,1]
["Other",29,1,1,1,1,1]
["Other",30,1,1,1,1,1]