{"text_format":"1","workbook":"xlsx","n_sheets":14,"sheets":["2023 NIST (for reference)","User Inputs_FPI_Calculator","Help enabling macros","More information","Calculator","Diagram","WPN 22-10","Results_convert_json","References","Results (2)","Results","Sheet1","States","Sheet3"],"not_rendered":{"charts":0,"images":8,"macros":1,"external_links":0,"defined_names":6,"comments":0,"pivot_tables":0},"unopened":[],"bounds":{"document_bytes":16777216,"sheet_cells":100000,"rows_first":2000,"rows_last":500,"rows_between":2000,"halvings":0,"cell_chars":16384,"cell_head_chars":4096},"cells_cut":0,"cells_raw":0,"read":"whole","date_system":"1900"}

{"sheet":"2023 NIST (for reference)","index":0,"n_rows":250,"n_cols":19,"rows_kept":250,"cut":false,"hidden":true,"merged":[]}
[null,null,null,null,"$/MMBtu","$/MMBtu","$/MMBtu","$/MMBtu","$/MMBtu","FPI","FPI","FPI","FPI","FPI","UPV","UPV","UPV","UPV","UPV"]
["Lookup Reference",null,"Year","Fuel Type","Region 1 - Northeast","Region 2 - Midwest","Region 3 - South","Region 4 - West","Region 5 - US",{"$f":"E2","v":"Region 1 - Northeast"},{"$f":"F2","v":"Region 2 - Midwest"},"Region 3 - South","Region 4 - West","Region 5 - US",{"$f":"J2","v":"Region 1 - Northeast"},{"$f":"K2","v":"Region 2 - Midwest"},"Region 3 - South","Region 4 - West","Region 5 - US"]
[{"$f":"C3&D3","v":"0Natural Gas"},2023,0,"Natural Gas",null,null,null,null,null,1,1,1,1,1]
["1Natural Gas",{"$f":"B3+1","v":2024},1,"Natural Gas",null,null,null,null,null,0.91329204069882641,0.89219487537819597,0.95417376898279616,0.98031290628534118,0.92914110822615636]
["2Natural Gas",{"$f":"B4+1","v":2025},2,"Natural Gas",null,null,null,null,null,0.85663072325214251,0.81883333710470174,0.92388425678430797,0.91127274490115895,0.86915379139806792]
["3Natural Gas",2026,3,"Natural Gas",null,null,null,null,null,0.821405504535209,0.77327755929571562,0.90091552712611356,0.83484140401895668,0.82420581968139972]
{"$rows_left_out":245}
{"sheet":"User Inputs_FPI_Calculator","index":1,"n_rows":250,"n_cols":34,"rows_kept":250,"cut":false,"hidden":false,"merged":[[0,31,0,33],[8,3,9,3],[8,2,9,2],[0,1,0,11],[0,27,0,29],[4,2,4,3],[2,4,2,6],[4,4,4,6],[1,24,1,25],[0,24,0,25]]}
[null,"FPI Calculator\nSCC-Inclusive Fuel Price Index Calculator: Enhancing WA with Non-Energy Benefits",null,null,null,null,null,null,null,null,null,null,null,null,null,"FPI for v8.9 (adjusted for 30 yr UPV)","FPI_SCC for v8.9 (adjusted for 30 year UPV)",null,null,null,"FPI for v10","FPI_SCC for v10",null,null,{"$f":"H9","v":"Modified fuel price"},null,null,{"$f":"INDEX(P1:V1,MATCH(E3, P1:V1,0))","v":"FPI_SCC for v8.9 (adjusted for 30 year UPV)"},null,null,null,{"$f":"AB1&\" : \" & AD2","v":"FPI_SCC for v8.9 (adjusted for 30 year UPV) : Region 4 - West"}]
[null,null,null,null,null,null,null,null,null,null,null,null,null,"Year","Fuel Type",{"$f":"'User Inputs_FPI_Calculator'!$I$5","v":"Region 4 - West"},{"$f":"'User Inputs_FPI_Calculator'!$I$5","v":"Region 4 - West"},null,"Year","Fuel Type",{"$f":"'User Inputs_FPI_Calculator'!$I$5","v":"Region 4 - West"},{"$f":"'User Inputs_FPI_Calculator'!$I$5","v":"Region 4 - West"},null,null,{"$f":"H10","v":"$/fuel unit"},null,null,{"$f":"S2","v":"Year"},{"$f":"T2","v":"Fuel Type"},{"$f":" V2","v":"Region 4 - West"},null,{"$f":"AC2","v":"Fuel Type"},{"$f":"AB2","v":"Year"},{"$f":"AD2","v":"Region 4 - West"}]
[null,"Step 1","Select Calculator Output",null,"FPI_SCC for v8.9 (adjusted for 30 year UPV)",null,null,null,null,null,null,null,null,0,"Natural Gas",{"$f":"INDEX(Calculator!$D$6:$CM$36,MATCH($N3&P$2,Calculator!$A$6:$A$36,0),MATCH(P$1&$O3,Calculator!$D$2:$CM$2,0))","v":1},{"$f":"INDEX(Calculator!$D$6:$CM$36,MATCH($N3&Q$2,Calculator!$A$6:$A$36,0),MATCH(Q$1&$O3,Calculator!$D$2:$CM$2,0))","v":1},null,0,"Electricity",{"$f":"INDEX(Calculator!$D$6:$CM$36,MATCH($S3&U$2,Calculator!$A$6:$A$36,0),MATCH(U$1&$T3,Calculator!$D$2:$CM$2,0))","v":1},{"$f":"INDEX(Calculator!$D$6:$CM$36,MATCH($S3&V$2,Calculator!$A$6:$A$36,0),MATCH(V$1&$T3,Calculator!$D$2:$CM$2,0))","v":1},null,null,{"$f":"C11","v":"Natural Gas"},{"$f":"H11","v":18.277986509999998},null,{"$f":"IF(OR($AB$1=\"FPI for v10\", $AB$1=\"FPI_SCC for v10\"), $S3, $N3)","v":0},{"$f":"IF(OR($AB$1=\"FPI for v10\", $AB$1=\"FPI_SCC for v10\"), $T3, $O3)","v":"Natural Gas"},{"$f":"INDEX(P3:V3,0, MATCH($AB$1,$P$1:$V$1,0))","v":1},null,{"$f":"AC3","v":"Natural Gas"},{"$f":"AB3","v":0},{"$f":"AD3","v":1}]
[null,null,null,null,null,null,null,null,null,null,null,null,null,1,"Natural Gas",{"$f":"INDEX(Calculator!$D$6:$CM$36,MATCH($N4&P$2,Calculator!$A$6:$A$36,0),MATCH(P$1&$O4,Calculator!$D$2:$CM$2,0))","v":0.98031290628534118},{"$f":"INDEX(Calculator!$D$6:$CM$36,MATCH($N4&Q$2,Calculator!$A$6:$A$36,0),MATCH(Q$1&$O4,Calculator!$D$2:$CM$2,0))","v":0.98644692290046421},null,1,"Electricity",{"$f":"INDEX(Calculator!$D$6:$CM$36,MATCH($S4&U$2,Calculator!$A$6:$A$36,0),MATCH(U$1&$T4,Calculator!$D$2:$CM$2,0))","v":0.9348597229818798},{"$f":"INDEX(Calculator!$D$6:$CM$36,MATCH($S4&V$2,Calculator!$A$6:$A$36,0),MATCH(V$1&$T4,Calculator!$D$2:$CM$2,0))","v":0.94013512917764552},null,null,"Oil",{"$f":"H12","v":4.1200700000000001},null,1,"Natural Gas",{"$f":"INDEX(P4:V4,0, MATCH($AB$1,$P$1:$V$1,0))","v":0.98644692290046421},null,{"$f":"AC4","v":"Natural Gas"},{"$f":"AB4","v":1},{"$f":"AD4","v":0.98644692290046421}]
[null,"Step 2","Select State",null,"Alaska",null,null,null,{"$f":"VLOOKUP(E5,States!A2:B53,2,FALSE)","v":"Region 4 - West"},null,null,null,null,2,"Natural Gas",{"$f":"INDEX(Calculator!$D$6:$CM$36,MATCH($N5&P$2,Calculator!$A$6:$A$36,0),MATCH(P$1&$O5,Calculator!$D$2:$CM$2,0))","v":0.91127274490115895},{"$f":"INDEX(Calculator!$D$6:$CM$36,MATCH($N5&Q$2,Calculator!$A$6:$A$36,0),MATCH(Q$1&$O5,Calculator!$D$2:$CM$2,0))","v":0.93139274010388873},null,2,"Electricity",{"$f":"INDEX(Calculator!$D$6:$CM$36,MATCH($S5&U$2,Calculator!$A$6:$A$36,0),MATCH(U$1&$T5,Calculator!$D$2:$CM$2,0))","v":0.86722030620246682},{"$f":"INDEX(Calculator!$D$6:$CM$36,MATCH($S5&V$2,Calculator!$A$6:$A$36,0),MATCH(V$1&$T5,Calculator!$D$2:$CM$2,0))","v":0.87158944043772812},null,null,"Electricity",0.1699,null,2,"Natural Gas",{"$f":"INDEX(P5:V5,0, MATCH($AB$1,$P$1:$V$1,0))","v":0.93139274010388873},null,"Natural Gas",2,0.93139274010388873]
[null,null,"Skip step 3 & 4 for FPI without SCC and go to step 5",null,null,null,null,null,null,null,null,null,null,3,"Natural Gas",{"$f":"INDEX(Calculator!$D$6:$CM$36,MATCH($N6&P$2,Calculator!$A$6:$A$36,0),MATCH(P$1&$O6,Calculator!$D$2:$CM$2,0))","v":0.83484140401895668},{"$f":"INDEX(Calculator!$D$6:$CM$36,MATCH($N6&Q$2,Calculator!$A$6:$A$36,0),MATCH(Q$1&$O6,Calculator!$D$2:$CM$2,0))","v":0.87012329782988573},null,3,"Electricity",{"$f":"INDEX(Calculator!$D$6:$CM$36,MATCH($S6&U$2,Calculator!$A$6:$A$36,0),MATCH(U$1&$T6,Calculator!$D$2:$CM$2,0))","v":0.84483048522146464},{"$f":"INDEX(Calculator!$D$6:$CM$36,MATCH($S6&V$2,Calculator!$A$6:$A$36,0),MATCH(V$1&$T6,Calculator!$D$2:$CM$2,0))","v":0.84946776211430075},null,null,"Propane",2.69475,null,3,"Natural Gas",{"$f":"INDEX(P6:V6,0, MATCH($AB$1,$P$1:$V$1,0))","v":0.87012329782988573},null,"Natural Gas",3,0.87012329782988573]
{"$rows_left_out":245}
{"sheet":"Help enabling macros","index":2,"n_rows":0,"n_cols":0,"rows_kept":0,"cut":false,"hidden":false,"merged":[]}

{"sheet":"More information","index":3,"n_rows":24,"n_cols":2,"rows_kept":24,"cut":false,"hidden":false,"merged":[]}
[]
[]
[]
[]
[]
[]
{"$rows_left_out":19}
{"sheet":"Calculator","index":4,"n_rows":73,"n_cols":91,"rows_kept":73,"cut":false,"hidden":true,"merged":[[4,0,4,2],[2,83,2,90],[2,3,2,10],[2,35,2,42],[2,11,2,18],[2,19,2,26],[2,27,2,34],[2,75,2,82],[2,59,2,66],[2,67,2,74],[2,43,2,50],[2,51,2,58]]}
[null,null,null,"FPI for v10",{"$f":"D1","v":"FPI for v10"},{"$f":"E1","v":"FPI for v10"},"FPI for v10","FPI for v10","FPI for v10","FPI for v10","FPI for v10","UPV_v10","UPV_v10","UPV_v10","UPV_v10","UPV_v10","UPV_v10","UPV_v10","UPV_v10","FPI for v8.9 (adjusted for 30 yr UPV)","FPI for v8.9 (adjusted for 30 yr UPV)","FPI for v8.9 (adjusted for 30 yr UPV)","FPI for v8.9 (adjusted for 30 yr UPV)","FPI for v8.9 (adjusted for 30 yr UPV)","FPI for v8.9 (adjusted for 30 yr UPV)","FPI for v8.9 (adjusted for 30 yr UPV)","FPI for v8.9 (adjusted for 30 yr UPV)","UPV_v8","UPV_v8","UPV_v8","UPV_v8","UPV_v8","UPV_v8","UPV_v8","UPV_v8",{"$f":"INDEX('User Inputs_FPI_Calculator'!$F$11:$F$18,MATCH(Calculator!AJ$4,'User Inputs_FPI_Calculator'!$C$11:$C$18,0),1)","v":3.4129999999999998E-3},{"$f":"INDEX('User Inputs_FPI_Calculator'!$F$11:$F$18,MATCH(Calculator!AK$4,'User Inputs_FPI_Calculator'!$C$11:$C$18,0),1)","v":1.0369999999999999},{"$f":"INDEX('User Inputs_FPI_Calculator'!$F$11:$F$18,MATCH(Calculator!AL$4,'User Inputs_FPI_Calculator'!$C$11:$C$18,0),1)","v":9.1499999999999998E-2},{"$f":"INDEX('User Inputs_FPI_Calculator'!$F$11:$F$18,MATCH(Calculator!AM$4,'User Inputs_FPI_Calculator'!$C$11:$C$18,0),1)","v":0.13850000000000001},{"$f":"INDEX('User Inputs_FPI_Calculator'!$F$11:$F$18,MATCH(Calculator!AN$4,'User Inputs_FPI_Calculator'!$C$11:$C$18,0),1)","v":0.13189999999999999},{"$f":"INDEX('User Inputs_FPI_Calculator'!$F$11:$F$18,MATCH(Calculator!AO$4,'User Inputs_FPI_Calculator'!$C$11:$C$18,0),1)","v":20.2},{"$f":"INDEX('User Inputs_FPI_Calculator'!$F$11:$F$18,MATCH(Calculator!AP$4,'User Inputs_FPI_Calculator'!$C$11:$C$18,0),1)","v":21},{"$f":"INDEX('User Inputs_FPI_Calculator'!$F$11:$F$18,MATCH(Calculator!AQ$4,'User Inputs_FPI_Calculator'!$C$11:$C$18,0),1)","v":1},"<-- Heat Content (MMBtu/fuel unit); from WAv10",null,null,null,null,null,null,null,null,null,null,null,null,null,null,null,"FPI_SCC for v10","FPI_SCC for v10","FPI_SCC for v10","FPI_SCC for v10","FPI_SCC for v10","FPI_SCC for v10","FPI_SCC for v10","FPI_SCC for v10","UPV_SCC_v10","UPV_SCC_v10",{"$f":"BQ1","v":"UPV_SCC_v10"},"UPV_SCC_v10","UPV_SCC_v10","UPV_SCC_v10","UPV_SCC_v10","UPV_SCC_v10","FPI_SCC for v8.9 (adjusted for 30 year UPV)","FPI_SCC for v8.9 (adjusted for 30 year UPV)","FPI_SCC for v8.9 (adjusted for 30 year UPV)","FPI_SCC for v8.9 (adjusted for 30 year UPV)","FPI_SCC for v8.9 (adjusted for 30 year UPV)","FPI_SCC for v8.9 (adjusted for 30 year UPV)","FPI_SCC for v8.9 (adjusted for 30 year UPV)","FPI_SCC for v8.9 (adjusted for 30 year UPV)","UPV_SCC_v8","UPV_SCC_v8","UPV_SCC_v8","UPV_SCC_v8","UPV_SCC_v8","UPV_SCC_v8","UPV_SCC_v8","UPV_SCC_v8"]
[null,null,null,{"$f":"D1&D4","v":"FPI for v10Electricity"},"FPI for v10Natural Gas","FPI for v10Propane","FPI for v10Oil","FPI for v10Kerosene","FPI for v10Wood","FPI for v10Coal","FPI for v10Other","UPV_v10Electricity","UPV_v10Natural Gas","UPV_v10Propane","UPV_v10Oil","UPV_v10Kerosene","UPV_v10Wood","UPV_v10Coal","UPV_v10Other","FPI for v8.9 (adjusted for 30 yr UPV)Electricity","FPI for v8.9 (adjusted for 30 yr UPV)Natural Gas","FPI for v8.9 (adjusted for 30 yr UPV)Propane","FPI for v8.9 (adjusted for 30 yr UPV)Oil","FPI for v8.9 (adjusted for 30 yr UPV)Kerosene","FPI for v8.9 (adjusted for 30 yr UPV)Wood","FPI for v8.9 (adjusted for 30 yr UPV)Coal","FPI for v8.9 (adjusted for 30 yr UPV)Other","UPV_v8Electricity","UPV_v8Natural Gas","UPV_v8Propane","UPV_v8Oil","UPV_v8Kerosene","UPV_v8Wood","UPV_v8Coal","UPV_v8Other","kWh","Mcf","Gallon","Gallon","Gallon","Cord","Short Ton","MMBtu","kWh","therm","Gallon","Gallon","Gallon","Cord","Short Ton","MMBtu",{"$f":"AJ2","v":"kWh"},"Mcf","Gallon","Gallon","Gallon","Cord","Short Ton","MMBtu",{"$f":"BH1&BH4","v":"FPI_SCC for v10Electricity"},"FPI_SCC for v10Natural Gas","FPI_SCC for v10Propane","FPI_SCC for v10Oil","FPI_SCC for v10Kerosene","FPI_SCC for v10Wood","FPI_SCC for v10Coal","FPI_SCC for v10Other","UPV_SCC_v10Electricity","UPV_SCC_v10Natural Gas","UPV_SCC_v10Propane","UPV_SCC_v10Oil","UPV_SCC_v10Kerosene","UPV_SCC_v10Wood","UPV_SCC_v10Coal","UPV_SCC_v10Other","FPI_SCC for v8.9 (adjusted for 30 year UPV)Electricity","FPI_SCC for v8.9 (adjusted for 30 year UPV)Natural Gas","FPI_SCC for v8.9 (adjusted for 30 year UPV)Propane","FPI_SCC for v8.9 (adjusted for 30 year UPV)Oil","FPI_SCC for v8.9 (adjusted for 30 year UPV)Kerosene","FPI_SCC for v8.9 (adjusted for 30 year UPV)Wood","FPI_SCC for v8.9 (adjusted for 30 year UPV)Coal","FPI_SCC for v8.9 (adjusted for 30 year UPV)Other","UPV_SCC_v8Electricity","UPV_SCC_v8Natural Gas","UPV_SCC_v8Propane","UPV_SCC_v8Oil","UPV_SCC_v8Kerosene","UPV_SCC_v8Wood","UPV_SCC_v8Coal","UPV_SCC_v8Other"]
[null,null,null,"FPI (v10); from 2023 NIST",null,null,null,null,null,null,null,"UPV (v10)",null,null,null,null,null,null,null,"FPI (v8.9_30yEqv)",null,null,null,null,null,null,null,"UPV (v8.9_30yEqv)",null,null,null,null,null,null,null,"Projected Fuel Price = FPI * Base Year Fuel Price",null,null,null,null,null,null,null,"Fuel Price Modifier (2020$/fuel unit); from WPN 22-10",null,null,null,null,null,null,null,"Modified Fuel Price ($/fuel unit) = Projected + Modifier",null,null,null,null,null,null,null,"FPI_SCC (v10)",null,null,null,null,null,null,null,"UPV_SCC (v10)",null,null,null,null,null,null,null,"FPI_SCC (v8.9_30yEqv)",null,null,null,null,null,null,null,"UPV_SCC (v8.9_30yEqv)"]
["Discount Rate =",null,0.03,"Electricity","Natural Gas","Propane","Oil","Kerosene","Wood","Coal","Other",{"$f":"D4","v":"Electricity"},{"$f":"E4","v":"Natural Gas"},"Propane","Oil","Kerosene","Wood","Coal","Other","Electricity","Natural Gas","Propane","Oil","Kerosene","Wood","Coal","Other",{"$f":"T4","v":"Electricity"},"Natural Gas","Propane","Oil","Kerosene","Wood","Coal","Other","Electricity","Natural Gas","Propane","Oil","Kerosene","Wood","Coal","Other",{"$f":"AJ4","v":"Electricity"},"Natural Gas","Propane","Oil","Kerosene","Wood","Coal","Other","Electricity","Natural Gas","Propane","Oil","Kerosene","Wood","Coal","Other","Electricity","Natural Gas","Propane","Oil","Kerosene","Wood","Coal","Other","Electricity","Natural Gas","Propane","Oil","Kerosene","Wood","Coal","Other","Electricity",{"$f":"BQ4","v":"Natural Gas"},"Propane","Oil","Kerosene","Wood","Coal","Other","Electricity","Natural Gas","Propane","Oil","Kerosene","Wood","Coal","Other"]
[{"$f":"'User Inputs_FPI_Calculator'!$I$5","v":"Region 4 - West"},null,null,null,null,null,null,null,null,null,null,null,null,null,null,null,null,null,null,null,null,null,null,null,null,null,null,null,null,null,null,null,null,null,"2022 NIST Fuel Price ($/fuel unit) =",{"$f":"INDEX('User Inputs_FPI_Calculator'!$E$11:$E$18,MATCH(Calculator!AJ$4,'User Inputs_FPI_Calculator'!$C$11:$C$18,0),1)","v":0.15},{"$f":"INDEX('User Inputs_FPI_Calculator'!$E$11:$E$18,MATCH(Calculator!AK$4,'User Inputs_FPI_Calculator'!$C$11:$C$18,0),1)","v":15.37},{"$f":"INDEX('User Inputs_FPI_Calculator'!$E$11:$E$18,MATCH(Calculator!AL$4,'User Inputs_FPI_Calculator'!$C$11:$C$18,0),1)","v":2.39},{"$f":"INDEX('User Inputs_FPI_Calculator'!$E$11:$E$18,MATCH(Calculator!AM$4,'User Inputs_FPI_Calculator'!$C$11:$C$18,0),1)","v":3.58},{"$f":"INDEX('User Inputs_FPI_Calculator'!$E$11:$E$18,MATCH(Calculator!AN$4,'User Inputs_FPI_Calculator'!$C$11:$C$18,0),1)","v":3.44},{"$f":"INDEX('User Inputs_FPI_Calculator'!$E$11:$E$18,MATCH(Calculator!AO$4,'User Inputs_FPI_Calculator'!$C$11:$C$18,0),1)","v":280},{"$f":"INDEX('User Inputs_FPI_Calculator'!$E$11:$E$18,MATCH(Calculator!AP$4,'User Inputs_FPI_Calculator'!$C$11:$C$18,0),1)","v":56.32},{"$f":"INDEX('User Inputs_FPI_Calculator'!$E$11:$E$18,MATCH(Calculator!AQ$4,'User Inputs_FPI_Calculator'!$C$11:$C$18,0),1)","v":0},null,null,null,null,null,null,null,"Modified Fuel Price ($/fuel unit) =",{"$f":"AZ6","v":0.1699},{"$f":"BA6","v":18.277986509999998},2.69475,4.1200700000000001,3.98007,380.42228,56.32,0]
[{"$f":"C6&B6","v":"0Region 4 - West"},{"$f":"A5","v":"Region 4 - West"},0,{"$f":"INDEX('2023 NIST (for reference)'!$J$3:$N$250,MATCH(Calculator!$C6&D$4,'2023 NIST (for reference)'!$A$3:$A$250,0),MATCH(Calculator!$B6,'2023 NIST (for reference)'!$J$2:$N$2,0))","v":1},{"$f":"INDEX('2023 NIST (for reference)'!$J$3:$N$250,MATCH(Calculator!$C6&E$4,'2023 NIST (for reference)'!$A$3:$A$250,0),MATCH(Calculator!$B6,'2023 NIST (for reference)'!$J$2:$N$2,0))","v":1},{"$f":"INDEX('2023 NIST (for reference)'!$J$3:$N$250,MATCH(Calculator!$C6&F$4,'2023 NIST (for reference)'!$A$3:$A$250,0),MATCH(Calculator!$B6,'2023 NIST (for reference)'!$J$2:$N$2,0))","v":1},{"$f":"INDEX('2023 NIST (for reference)'!$J$3:$N$250,MATCH(Calculator!$C6&G$4,'2023 NIST (for reference)'!$A$3:$A$250,0),MATCH(Calculator!$B6,'2023 NIST (for reference)'!$J$2:$N$2,0))","v":1},{"$f":"INDEX('2023 NIST (for reference)'!$J$3:$N$250,MATCH(Calculator!$C6&H$4,'2023 NIST (for reference)'!$A$3:$A$250,0),MATCH(Calculator!$B6,'2023 NIST (for reference)'!$J$2:$N$2,0))","v":1},{"$f":"INDEX('2023 NIST (for reference)'!$J$3:$N$250,MATCH(Calculator!$C6&I$4,'2023 NIST (for reference)'!$A$3:$A$250,0),MATCH(Calculator!$B6,'2023 NIST (for reference)'!$J$2:$N$2,0))","v":1},{"$f":"INDEX('2023 NIST (for reference)'!$J$3:$N$250,MATCH(Calculator!$C6&J$4,'2023 NIST (for reference)'!$A$3:$A$250,0),MATCH(Calculator!$B6,'2023 NIST (for reference)'!$J$2:$N$2,0))","v":1},{"$f":"INDEX('2023 NIST (for reference)'!$J$3:$N$250,MATCH(Calculator!$C6&K$4,'2023 NIST (for reference)'!$A$3:$A$250,0),MATCH(Calculator!$B6,'2023 NIST (for reference)'!$J$2:$N$2,0))","v":1},{"$f":"D6/((1+$C$4)^$C6)","v":1},1,1,1,1,1,1,1,{"$f":"D6","v":1},{"$f":"E6","v":1},{"$f":"F6","v":1},{"$f":"G6","v":1},{"$f":"H6","v":1},{"$f":"I6","v":1},{"$f":"J6","v":1},{"$f":"K6","v":1},{"$f":"T6/((1+$C$4)^$C6)","v":1},1,1,1,1,1,1,1,{"$f":"AJ$5*D6","v":0.15},{"$f":"AK$5*E6","v":15.37},{"$f":"AL$5*F6","v":2.39},{"$f":"AM$5*G6","v":3.58},{"$f":"AN$5*H6","v":3.44},{"$f":"AO$5*I6","v":280},{"$f":"AP$5*J6","v":56.32},{"$f":"AQ$5*K6","v":0},1.9900000000000001E-2,0.28042299999999998,0.30474999999999997,0.54006999999999994,0.54006999999999994,100.42227999999999,0,0,{"$f":"AJ6+AR6","v":0.1699},{"$f":"AK6+AS6*($AK$1*10)","v":18.277986509999998},{"$f":"AL6+AT6","v":2.69475},{"$f":"AM6+AU6","v":4.1200700000000001},{"$f":"AN6+AV6","v":3.98007},{"$f":"AO6+AW6","v":380.42228},{"$f":"AP6+AX6","v":56.32},{"$f":"AQ6+AY6","v":0},{"$f":"IFERROR(AZ6/AZ$6,D6)","v":1},{"$f":"IFERROR(BA6/BA$6,E6)","v":1},{"$f":"IFERROR(BB6/BB$6,F6)","v":1},{"$f":"IFERROR(BC6/BC$6,G6)","v":1},{"$f":"IFERROR(BD6/BD$6,H6)","v":1},{"$f":"IFERROR(BE6/BE$6,I6)","v":1},{"$f":"IFERROR(BF6/BF$6,J6)","v":1},{"$f":"IFERROR(BG6/BG$6,K6)","v":1},{"$f":"BH6/((1+$C$4)^$C6)","v":1},1,1,1,1,1,1,1,{"$f":"BH6","v":1},{"$f":"BI6","v":1},{"$f":"BJ6","v":1},{"$f":"BK6","v":1},{"$f":"BL6","v":1},{"$f":"BM6","v":1},{"$f":"BN6","v":1},{"$f":"BO6","v":1},{"$f":"BX6/((1+$C$4)^$C6)","v":1},1,1,1,1,1,1,1]
{"$rows_left_out":68}
{"sheet":"Diagram","index":5,"n_rows":27,"n_cols":4,"rows_kept":27,"cut":false,"hidden":true,"merged":[]}
[]
[]
[]
[]
[]
[]
{"$rows_left_out":22}
{"sheet":"WPN 22-10","index":6,"n_rows":38,"n_cols":10,"rows_kept":38,"cut":false,"hidden":true,"merged":[[11,9,14,9],[8,9,9,9]]}
[]
[]
[]
[]
[]
[]
{"$rows_left_out":33}
{"sheet":"Results_convert_json","index":7,"n_rows":249,"n_cols":6,"rows_kept":249,"cut":false,"hidden":true,"merged":[]}
["baseyear","censusregion","fuel_escalation_rates","fuel_type_id","fuel_name","rate"]
[2023,{"$f":"IF('User Inputs_FPI_Calculator'!I5=\"Region 1 - Northeast\", 1, IF('User Inputs_FPI_Calculator'!I5=\"Region 2 - Midwest\", 2, IF('User Inputs_FPI_Calculator'!I5=\"Region 3 - South\", 3, IF('User Inputs_FPI_Calculator'!I5=\"Region 4 - West\", 4, IF('User Inputs_FPI_Calculator'!I5=\"Region 5 - US\", 5, \"\")))))","v":4},null,{"$f":"IF('User Inputs_FPI_Calculator'!E3 = \"FPI for v8.9 (adjusted for 30 yr UPV)\", 1, IF('User Inputs_FPI_Calculator'!E3 =  \"FPI_SCC for v8.9 (adjusted for 30 year UPV)\", 1, IF('User Inputs_FPI_Calculator'!E3 = \"FPI for v10\", 3, IF('User Inputs_FPI_Calculator'!E3 = \"FPI_SCC for v10\", 3, \"\"))))","v":1},{"$f":"'User Inputs_FPI_Calculator'!AF3","v":"Natural Gas"},{"$f":"'User Inputs_FPI_Calculator'!AH3","v":1}]
[null,null,null,null,{"$f":"'User Inputs_FPI_Calculator'!AF4","v":"Natural Gas"},{"$f":"'User Inputs_FPI_Calculator'!AH4","v":0.98644692290046421}]
[null,null,null,null,{"$f":"'User Inputs_FPI_Calculator'!AF5","v":"Natural Gas"},{"$f":"'User Inputs_FPI_Calculator'!AH5","v":0.93139274010388873}]
[null,null,null,null,{"$f":"'User Inputs_FPI_Calculator'!AF6","v":"Natural Gas"},{"$f":"'User Inputs_FPI_Calculator'!AH6","v":0.87012329782988573}]
[null,null,null,null,{"$f":"'User Inputs_FPI_Calculator'!AF7","v":"Natural Gas"},{"$f":"'User Inputs_FPI_Calculator'!AH7","v":0.81951711053496357}]
{"$rows_left_out":244}
{"sheet":"References","index":8,"n_rows":22,"n_cols":5,"rows_kept":22,"cut":false,"hidden":true,"merged":[[20,3,21,3]]}
[]
[]
[]
[]
[null,null,null,"References:","1) The projected real FPIs are obtained from Table Ca-1 through Table Ca-5 in the data tables available at https://data.nist.gov/od/id/mds2-3069"]
[]
{"$rows_left_out":17}
{"sheet":"Results (2)","index":9,"n_rows":250,"n_cols":5,"rows_kept":250,"cut":false,"hidden":true,"merged":[[0,2,0,4]]}
["baseyear","censusregion","fuel_escalation_rates"]
[2022,{"$f":"IF('User Inputs_FPI_Calculator'!I5=\"Region 1 - Northeast\", 1, IF('User Inputs_FPI_Calculator'!I5=\"Region 2 - Midwest\", 2, IF('User Inputs_FPI_Calculator'!I5=\"Region 3 - South\", 3, IF('User Inputs_FPI_Calculator'!I5=\"Region 4 - West\", 4, IF('User Inputs_FPI_Calculator'!I5=\"Region 5 - US\", 5, \"\")))))","v":4},"fuel_type_id","fuel_name","rate"]
[null,null,{"$f":"IF('User Inputs_FPI_Calculator'!E3 = \"FPI for v8.9 (adjusted for 30 yr UPV)\", 1, IF('User Inputs_FPI_Calculator'!E3 =  \"FPI_SCC for v8.9 (adjusted for 30 year UPV)\", 1, IF('User Inputs_FPI_Calculator'!E3 = \"FPI for v10\", 3, IF('User Inputs_FPI_Calculator'!E3 = \"FPI_SCC for v10\", 3, \"\"))))","v":1},{"$f":"'User Inputs_FPI_Calculator'!AF3","v":"Natural Gas"},{"$f":"'User Inputs_FPI_Calculator'!AH3","v":1}]
[null,null,null,{"$f":"'User Inputs_FPI_Calculator'!AF4","v":"Natural Gas"},{"$f":"'User Inputs_FPI_Calculator'!AH4","v":0.98644692290046421}]
[null,null,null,{"$f":"'User Inputs_FPI_Calculator'!AF5","v":"Natural Gas"},{"$f":"'User Inputs_FPI_Calculator'!AH5","v":0.93139274010388873}]
[null,null,null,{"$f":"'User Inputs_FPI_Calculator'!AF6","v":"Natural Gas"},{"$f":"'User Inputs_FPI_Calculator'!AH6","v":0.87012329782988573}]
{"$rows_left_out":245}
{"sheet":"Results","index":10,"n_rows":249,"n_cols":8,"rows_kept":249,"cut":false,"hidden":true,"merged":[]}
["Fuel Type","Year"," Region 1 - Northeast "]
[{"$f":"'User Inputs_FPI_Calculator'!AF3","v":"Natural Gas"},{"$f":"'User Inputs_FPI_Calculator'!AG3","v":0},{"$f":"'User Inputs_FPI_Calculator'!AH3","v":1}]
[{"$f":"'User Inputs_FPI_Calculator'!AF4","v":"Natural Gas"},{"$f":"'User Inputs_FPI_Calculator'!AG4","v":1},{"$f":"'User Inputs_FPI_Calculator'!AH4","v":0.98644692290046421}]
[{"$f":"'User Inputs_FPI_Calculator'!AF5","v":"Natural Gas"},{"$f":"'User Inputs_FPI_Calculator'!AG5","v":2},{"$f":"'User Inputs_FPI_Calculator'!AH5","v":0.93139274010388873}]
[{"$f":"'User Inputs_FPI_Calculator'!AF6","v":"Natural Gas"},{"$f":"'User Inputs_FPI_Calculator'!AG6","v":3},{"$f":"'User Inputs_FPI_Calculator'!AH6","v":0.87012329782988573}]
[{"$f":"'User Inputs_FPI_Calculator'!AF7","v":"Natural Gas"},{"$f":"'User Inputs_FPI_Calculator'!AG7","v":4},{"$f":"'User Inputs_FPI_Calculator'!AH7","v":0.81951711053496357},null,null,null,"fuel_name","fuel_type_id"]
{"$rows_left_out":244}
{"sheet":"Sheet1","index":11,"n_rows":103,"n_cols":16,"rows_kept":103,"cut":false,"hidden":true,"merged":[]}
["Sub json111()",null,null,null,null,null,null,"Sub json111()",null,null,null,null,null,null,null,"Sub json111()"]
[]
["Set wb = ActiveWorkbook",null,null,null,null,null,null,"Set wb = ActiveWorkbook",null,null,null,null,null,null,null,"Set wb = ActiveWorkbook"]
["Set wi = wb.Sheets(\"Results_convert_json\")",null,null,null,null,null,null,"Set wi = wb.Sheets(\"Results_convert_json\")",null,null,null,null,null,null,null,"Set wi = wb.Sheets(\"Results_convert_json\")"]
["lrow = wi.Cells(wi.Rows.Count, 6).End(xlUp).Row",null,null,null,null,null,null,"lrow = wi.Cells(wi.Rows.Count, 6).End(xlUp).Row",null,null,null,null,null,null,null,"lrow = wi.Cells(wi.Rows.Count, 6).End(xlUp).Row"]
["Dim headerRange As Range: Set headerRange = wi.Range(\"A1:Z1\")",null,null,null,null,null,null,"Dim headerRange As Range: Set headerRange = wi.Range(\"A1:Z1\")",null,null,null,null,null,null,null,"Dim headerRange As Range: Set headerRange = wi.Range(\"A1:Z1\")"]
{"$rows_left_out":98}
{"sheet":"States","index":12,"n_rows":56,"n_cols":10,"rows_kept":56,"cut":false,"hidden":true,"merged":[]}
["State","Region Name"]
["Alabama","Region 3 - South",null,null,"Alabama"]
["Alaska","Region 4 - West",null,null,"Alaska"]
["Arizona","Region 4 - West",null,null,"Arizona"]
["Arkansas","Region 3 - South",null,null,"Arkansas",null,null,null,"Region 1 - Northeast",1]
["California","Region 4 - West",null,null,"California",null,null,null,"Region 2 - Midwest",2]
{"$rows_left_out":51}
{"sheet":"Sheet3","index":13,"n_rows":249,"n_cols":7,"rows_kept":249,"cut":false,"hidden":true,"merged":[]}
["Fuel Type","Year","Region 5 - US","Region 1 - Noertheast","Region 2 - Midwest","Region 3 - South","Region 4 - West"]
["Electricity",0,1,1,1,1,1]
["Electricity",1,0.99502359641612781,1.0195608596508192,0.99162838678213061,0.99831013202143115,0.97796393722181196]
["Electricity",2,0.97821297213082592,1.0163926836206973,0.98274709601145671,0.9841588506471961,0.94229416491739582]
["Electricity",3,0.97032925021420591,1.0205199257419511,0.98127338078512027,0.97052226238314165,0.93629764693639239]
["Electricity",4,0.96909780724824535,1.0270835777146148,0.97409480830903594,0.96266120804374811,0.9499868335224394]
{"$rows_left_out":243}